PHP 4.0 Bug #5379: `gdImageCreateFromGif' undeclared
| From: | beast at infomedia dot lt | Date: | Wed, 05 Jul 2000 14:26:47 +0000 |
| Subject: | PHP 4.0 Bug #5379: `gdImageCreateFromGif' undeclared | ||
| Groups: | php.dev | ||
| Request: | Send a blank email to php-dev+get-23468@lists.php.net to get a copy of this message | ||
From: beast@infomedia.lt
Operating system: linux (redgat6.1)
PHP version: 4.0.0
PHP Bug Type: Compile Failure
Bug description: `gdImageCreateFromGif' undeclared
I follow all manuals, dcumentation and FAQ.
but can't compile
php: php-4.0.1pl2
apahce: 1.3.12 & 1.3.9
linux: redhat 6.1
kernel: 2.2.14
I try:
./configure --with-mysql --with-config-file-path=/usr/local/Apache/conf
--with-apache=../apache_1.3.12 --enable-track-vars
or
./configure --with-mysql --with-apxs
that's work.
but:
make:
* * *
make[2]: Leaving directory `/dist/tmp2/php-4.0.1pl2/ext/db'
Making all in gd
make[2]: Entering directory `/dist/tmp2/php-4.0.1pl2/ext/gd'
make[3]: Entering directory `/dist/tmp2/php-4.0.1pl2/ext/gd'
gcc -DHAVE_CONFIG_H -I. -I/dist/tmp2/php-4.0.1pl2/ext/gd -I/dist/tmp2/php-4.0.1pl2
-I/dist/tmp2/php-4.0.1pl2/main -I/dist/tmp2/apache_1.3.12/src/include
-I/dist/tmp2/apache_1.3.12/src/os/unix -I/dist/tmp2/php-4.0.1pl2/Zend -I/dist/tmp2/php-4.0.1pl2
-I/dist/tmp2/php-4.0.1pl2/ext/mysql/libmysql -I/dist/tmp2/php-4.0.1pl2/ext/xml/expat/xmltok
-I/dist/tmp2/php-4.0.1pl2/ext/xml/expat/xmlparse -DXML_BYTE_ORDER=12 -g -O2 -c gd.c &&
touch gd.lo
gd.c: In function `php_if_imagecreatefromgif':
gd.c:472: `gdImageCreateFromGif' undeclared (first use in this function)
gd.c:472: (Each undeclared identifier is reported only once
gd.c:472: for each function it appears in.)
gd.c: In function `php_if_imagegif':
gd.c:629: `gdImageGif' undeclared (first use in this function)
make[3]: *** [gd.lo] Error 1
make[3]: Leaving directory `/dist/tmp2/php-4.0.1pl2/ext/gd'
make[2]: *** [all-recursive] Error 1
make[2]: Leaving directory `/dist/tmp2/php-4.0.1pl2/ext/gd'
make[1]: *** [all-recursive] Error 1
make[1]: Leaving directory `/dist/tmp2/php-4.0.1pl2/ext'
make: *** [all-recursive] Error 1
(maybe I make something worng?)
waiting for response, thanks
Beast
beast@infomedia.lt