PHP 4.0 Bug #5852: make install gives error

From: Date: Sat, 29 Jul 2000 12:54:18 +0000
Subject: PHP 4.0 Bug #5852: make install gives error
Groups: php.dev 
Request: Send a blank email to php-dev+get-26817@lists.php.net to get a copy of this message
From: yusufg@outblaze.com Operating system: Linux 2.2.16 PHP version: 4.0 Latest CVS (29/07/2000) PHP Bug Type: Installation problem Bug description: make install gives error running make install on the PHP4 source tree gives the following errors make[1]: Leaving directory `/usr/local/src/phpbuild' Making install in pear make[1]: Entering directory `/usr/local/src/phpbuild/pear' make[2]: Entering directory `/usr/local/src/phpbuild/pear' cp: /usr/local/src/php4/pear/PEAR.php: No such file or directory creating header file hierarchy /usr/local/src/php4/build/shtool mkdir -p /usr/local/site/php/lib/php/build /usr/local/site/php/bin && \ (cd /usr/local/src/php4 && cp pear/pear.m4 build/fastgen.sh build/library.mk build/ltlib.mk build/program.mk build/rules.mk build/rules_pear.mk build/dynlib.mk build/shtool dynlib.m4 acinclude.m4 /usr/local/site/php/lib/php/build) for prog in phpize php-config pear phpextdist; do \ /usr/local/src/php4/build/shtool install -c -m 755 $prog /usr/local/site/php/bin/$prog; \ done cp: phpextdist: No such file or directory make[2]: *** [install-programs] Error 1 make[2]: Leaving directory `/usr/local/src/phpbuild/pear' make[1]: *** [install-recursive] Error 1 make[1]: Leaving directory `/usr/local/src/phpbuild/pear' make: *** [install-recursive] Error 1

« previous php.dev (#26817) next »