PHP 4.0 Bug #5916: error compiling zend-scanner.i

From: Date: Wed, 02 Aug 2000 07:25:15 +0000
Subject: PHP 4.0 Bug #5916: error compiling zend-scanner.i
Groups: php.dev 
Request: Send a blank email to php-dev+get-27392@lists.php.net to get a copy of this message
From: dengberg@austin.rr.com Operating system: Red Hat 6.1 PHP version: 4.0.1pl2 PHP Bug Type: Compile Failure Bug description: error compiling zend-scanner.i I did './configure --with-mysql --with-apxs' and then typed 'make' and I get /bin/sh ../libtool -silent --mode=compile gcc -DHAVE_CONFIG_H -I. -I. -I.. -DXML_BYTE_ORDER=21 -g -02 -c zend-scanner.c In file included from zend.h:57, from ./zend-scanner.l:41 /usr/include/dlfcn.h:53: parse error before '__handle' /usr/include/dlfcn.h:59: parse error before '__handle' make[1]: *** [zend-scanner.lo] Error 1 make[1] Leaving directory 'home/phaze/php-4.0.1pl2/Zend' make: *** [all-recursive] Error 1 I even tried PHP4.0 to see if it was a problem with 4.01 but it wasn't.

« previous php.dev (#27392) next »