PHP 4.0 Bug #5946: microtime.c error while running make

From: Date: Thu, 03 Aug 2000 17:00:19 +0000
Subject: PHP 4.0 Bug #5946: microtime.c error while running make
Groups: php.dev 
Request: Send a blank email to php-dev+get-27571@lists.php.net to get a copy of this message
From: jim@ohio.com Operating system: Slackware 7 kernel 2.2.16 PHP version: 4.0.1pl2 PHP Bug Type: Installation problem Bug description: microtime.c error while running make i have tried to install static and dso to no avail but this always happens: opus:/tmp/stuff/php-4.0.1pl2# make Making all in Zend .... Blah blah blah (stuff flies across screen...) until this comes up... TE_ORDER=12 -g -O2 -c microtime.c && touch microtime.lo microtime.c: In function `php_if_getrusage': microtime.c:97: storage size of `usg' isn't known microtime.c:100: `RUSAGE_SELF' undeclared (first use in this function) microtime.c:100: (Each undeclared identifier is reported only once microtime.c:100: for each function it appears in.) microtime.c:106: `RUSAGE_CHILDREN' undeclared (first use in this function) make[3]: *** [microtime.lo] Error 1 make[3]: Leaving directory `/tmp/stuff/php-4.0.1pl2/ext/standard' make[2]: *** [all-recursive] Error 1 make[2]: Leaving directory `/tmp/stuff/php-4.0.1pl2/ext/standard' make[1]: *** [all-recursive] Error 1 make[1]: Leaving directory `/tmp/stuff/php-4.0.1pl2/ext' make: *** [all-recursive] Error 1

« previous php.dev (#27571) next »