PHP 4.0 Bug #6013: Can't compile microtime.c

From: Date: Tue, 08 Aug 2000 02:46:42 +0000
Subject: PHP 4.0 Bug #6013: Can't compile microtime.c
Groups: php.dev 
Request: Send a blank email to php-dev+get-28055@lists.php.net to get a copy of this message
From: bravehearts@263.net Operating system: linux 2.2.5-15 PHP version: 4.0.1 PHP Bug Type: Compile Failure Bug description: Can't compile microtime.c Commands: #./configure --with-mysql=/usr/local/mysql --with-apache=../apache_1.3.12 --enable-track-vars", #make When "Making all in standard", it said: microtime.c: In function `php_if_getrusage': microtime.c:94: storage size of `usg' isn't known microtime.c:97: `RUSAGE_SELF' undeclared (first use in this function) microtime.c:97: (Each undeclared identifier is reported only once microtime.c:97: for each function it appears in.) microtime.c:103: `RUSAGE_CHILDREN' undeclared (first use in this function) make[3]: *** [microtime.lo] Error 1 make[3]: Leaving directory `/home/master/php-4.0.1/ext/standard' make[2]: *** [all-recursive] Error 1 make[2]: Leaving directory `/home/master/php-4.0.1/ext/standard' make[1]: *** [all-recursive] Error 1 make[1]: Leaving directory `/home/master/php-4.0.1/ext' make: *** [all-recursive] Error 1

« previous php.dev (#28055) next »