PHP 4.0 Bug #6086: url_scanner.c undeclared identifiers
| From: | mark dot faine at msfc dot nasa dot gov | Date: | Fri, 11 Aug 2000 00:33:10 +0000 |
| Subject: | PHP 4.0 Bug #6086: url_scanner.c undeclared identifiers | ||
| Groups: | php.dev | ||
| Request: | Send a blank email to php-dev+get-28415@lists.php.net to get a copy of this message | ||
From: mark.faine@msfc.nasa.gov
Operating system: Solaris 2.6
PHP version: 4.0 Latest CVS (10/08/2000)
PHP Bug Type: Compile Failure
Bug description: url_scanner.c undeclared identifiers
Compile failure
/temp/php4/TSRM -D_POSIX_PTHREAD_SEMANTICS -D_POSIX_PTHREAD_SEMANTICS -D_REENTR
ANT -DXML_BYTE_ORDER=21 -I../TSRM -g -O2 -pthreads -c url_scanner.c
url_scanner.c: In function `url_attr_addon':
url_scanner.c:63: `core_globals' undeclared (first use in this function)
url_scanner.c:63: (Each undeclared identifier is reported only once
url_scanner.c:63: for each function it appears in.)
url_scanner.c: In function `url_adapt':
url_scanner.c:88: `basic_globals' undeclared (first use in this function)
url_scanner.c:108: warning: unreachable code at beginning of switch statement
make[3]: *** [url_scanner.lo] Error 1
make[3]: Leaving directory `/raidb4/temp/php4/ext/standard'
make[2]: *** [all-recursive] Error 1
make[2]: Leaving directory `/raidb4/temp/php4/ext/standard'
make[1]: *** [all-recursive] Error 1
make[1]: Leaving directory `/raidb4/temp/php4/ext'
make: *** [all-recursive] Error 1
Thanks
Mark