RE: PHP 4.0 Bug #6086 Updated: url_scanner.c undeclared identifiers
| From: | Faine, Mark | Date: | Mon, 14 Aug 2000 12:35:03 +0000 |
| Subject: | RE: PHP 4.0 Bug #6086 Updated: url_scanner.c undeclared identifiers | ||
| Groups: | php.dev | ||
| Request: | Send a blank email to php-dev+get-28807@lists.php.net to get a copy of this message | ||
I am still having this problem:
CVS code from about 7:15am
here is how the make fails
/temp/php4/TSRM -D_POSIX_PTHREAD_SEMANTICS -D_POSIX_PTHREAD_SEMANTICS
-D_REENTR
ANT -DXML_BYTE_ORDER=21 -I../TSRM -g -O2 -pthreads -c url_scanner.c
url_scanner.c: In function `url_attr_addon':
url_scanner.c:63: `core_globals' undeclared (first use in this function)
url_scanner.c:63: (Each undeclared identifier is reported only once
url_scanner.c:63: for each function it appears in.)
url_scanner.c: In function `url_adapt':
url_scanner.c:88: `basic_globals' undeclared (first use in this function)
url_scanner.c:108: warning: unreachable code at beginning of switch
statement
make[3]: *** [url_scanner.lo] Error 1
make[3]: Leaving directory `/raidb4/temp/php4/ext/standard'
make[2]: *** [all-recursive] Error 1
make[2]: Leaving directory `/raidb4/temp/php4/ext/standard'
make[1]: *** [all-recursive] Error 1
make[1]: Leaving directory `/raidb4/temp/php4/ext'
make: *** [all-recursive] Error 1
#
Thanks for your help
-Mark
-----Original Message-----
From: Bug Database [mailto:php-dev@lists.php.net]
Sent: Monday, August 14, 2000 5:29 AM
To: mark.faine@msfc.nasa.gov
Subject: PHP 4.0 Bug #6086 Updated: url_scanner.c undeclared identifiers
ID: 6086
Updated by: hholzgra
Reported By: mark.faine@msfc.nasa.gov
Status: Feedback
Bug Type: Compile Failure
Assigned To:
Comments:
do you (or anybody else) still see this problem?
there was a short period of time when url_scanner.h
was not up to date in cvs, but i had it fixed
_before_ 10/8/2000 i think ... ??!?
Full Bug description available at: http://bugs.php.net/?id=6086