PHP 4.0 Bug #6086 Updated: url_scanner.c undeclared identifiers
| From: | Bug Database | Date: | Thu, 17 Aug 2000 12:20:58 +0000 |
| Subject: | PHP 4.0 Bug #6086 Updated: url_scanner.c undeclared identifiers | ||
| Groups: | php.dev | ||
| Request: | Send a blank email to php-dev+get-29255@lists.php.net to get a copy of this message | ||
ID: 6086
User Update by: mark.faine@msfc.nasa.gov
Status: Feedback
Bug Type: Compile Failure
Description: url_scanner.c undeclared identifiers
Still getting this problem, here is where the make fails:
/bin/sh /raidb4/temp/php4/libtool --silent --mode=compile gcc -DHAVE_CONFIG_H -
I. -I/raidb4/temp/php4/ext/standard -I/raidb4/temp/php4 -I/raidb4/temp/php4/main
-I/home/web_server/netscape/suitespot/include -I/raidb4/temp/php4/Zend -I/raidb
4/temp/php4 -I/home1/app/oracle/product/732/rdbms/public -I/home1/app/oracle/pro
duct/732/rdbms/demo -I/home1/app/oracle/product/732/network/public -I/raidb4/tem
p/php4/ext/xml/expat/xmltok -I/raidb4/temp/php4/ext/xml/expat/xmlparse -I/raidb4
/temp/php4/TSRM -D_POSIX_PTHREAD_SEMANTICS -D_POSIX_PTHREAD_SEMANTICS -D_REENTR
ANT -DXML_BYTE_ORDER=21 -I../TSRM -g -O2 -pthreads -c url_scanner.c
url_scanner.c: In function `url_attr_addon':
url_scanner.c:63: `core_globals' undeclared (first use in this function)
url_scanner.c:63: (Each undeclared identifier is reported only once
url_scanner.c:63: for each function it appears in.)
url_scanner.c: In function `url_adapt':
url_scanner.c:88: `basic_globals' undeclared (first use in this function)
url_scanner.c:108: warning: unreachable code at beginning of switch statement
make[3]: *** [url_scanner.lo] Error 1
make[3]: Leaving directory `/raidb4/temp/php4/ext/standard'
make[2]: *** [all-recursive] Error 1
make[2]: Leaving directory `/raidb4/temp/php4/ext/standard'
make[1]: *** [all-recursive] Error 1
make[1]: Leaving directory `/raidb4/temp/php4/ext'
make: *** [all-recursive] Error 1
starbase#
Full Bug description available at: http://bugs.php.net/?id=6086