PHP 4.0 Bug #6313: Problem compiling

From: Date: Wed, 23 Aug 2000 13:48:57 +0000
Subject: PHP 4.0 Bug #6313: Problem compiling
Groups: php.dev 
Request: Send a blank email to php-dev+get-30374@lists.php.net to get a copy of this message
From: pablo.rodriguez@corp.terra.com.ar Operating system: Solaris 2.6 PHP version: 4.0.1pl2 PHP Bug Type: Compile Failure Bug description: Problem compiling Im tring to install php 4.0.1pl2 with apache 1.3.12, php compilation works fine, but when I try to run the make tool with apache, after configuring it with this statement ./configure --prefix=/internet/programas/www --activate-module=src/modules/php4/libphp4.a crashes producing a core dump file. The error I get it's the following collect2: ld terminated with signal 10 [Bus Error], core dumped make[2]: *** [target_static] Error 1 make[2]: Leaving directory `/export/home/prodrigu/apache_1.3.12/src' make[1]: *** [build-std] Error 2 make[1]: Leaving directory `/export/home/prodrigu/apache_1.3.12' make: *** [build] Error 2 Is there any kind of problem with these elements working together?

« previous php.dev (#30374) next »