Re: PHP 4.0 Bug #5852 Updated: make install gives error

From: Date: Wed, 23 Aug 2000 14:01:50 +0000
Subject: Re: PHP 4.0 Bug #5852 Updated: make install gives error
References: 1  Groups: php.dev 
Request: Send a blank email to php-dev+get-30386@lists.php.net to get a copy of this message
Sorry Jani, Fresh CVS tree check out and I get the following error whilst doing make install. Keep in mind that I use a separate build tree. Given current CVS instructions, I cannot compile PHP4 in source tree creating header file hierarchy /usr/local/src/php4/build/shtool mkdir -p /usr/local/site/php/lib/php/build /usr/local/site/php/bin && \ (cd /usr/local/src/php4 && cp pear/pear.m4 build/fastgen.sh build/library.mk build/ltlib.mk build/program.mk build/rules.mk build/rules_common.mk build/rules_pear.mk build/dynlib.mk build/shtool dynlib.m4 acinclude.m4 /usr/local/site/php/lib/php/build) for prog in phpize php-config pear phpextdist; do \ /usr/local/src/php4/build/shtool install -c -m 755 $prog /usr/local/site/php/bin/$prog; \ done cp: phpextdist: No such file or directory make[2]: *** [install-programs] Error 1 make[2]: Leaving directory `/usr/local/src/phpbuild/pear' make[1]: *** [install-recursive] Error 1 make[1]: Leaving directory `/usr/local/src/phpbuild/pear' make: *** [install-recursive] Error 1 > ID: 5852 > Updated by: sniper > Reported By: yusufg@outblaze.com > Status: Feedback > Bug Type: Installation problem > Assigned To: > Comments: > > Have you tried more recent version (from CVS) ?? > If I remember correctly there have been some fixes regarding pear. > > --Jani > > Full Bug description available at: http://bugs.php.net/?id=5852 > -- Yusuf Goolamabbas yusufg@outblaze.com

« previous php.dev (#30386) next »