PHP 4.0 Bug #6373: I had an error running make (compiling)

From: Date: Sun, 27 Aug 2000 09:03:56 +0000
Subject: PHP 4.0 Bug #6373: I had an error running make (compiling)
Groups: php.dev 
Request: Send a blank email to php-dev+get-30802@lists.php.net to get a copy of this message
From: raulgd@ver.megared.net.mx Operating system: Yellow Dog Linux (linuxppc) PHP version: 4.0.1pl2 PHP Bug Type: Compile Failure Bug description: I had an error running make (compiling) ---HERE I RAN THE MAKE ---- [root@localhost php-4.0.1pl2]# make --- STARTED ---- Making all in Zend make[1]: Entering directory `/temp/php-4.0.1pl2/Zend' make[1]: Nothing to be done for `all'. make[1]: Leaving directory `/temp/php-4.0.1pl2/Zend' Making all in main make[1]: Entering directory `/temp/php-4.0.1pl2/main' make[2]: Entering directory `/temp/php-4.0.1pl2/main' gcc -DHAVE_CONFIG_H -I. -I/temp/php-4.0.1pl2/main -I/temp/php-4.0.1pl2 -I/temp/php-4.0.1pl2/ma in -I/temp/apache_1.3.12/src/include -I/temp/apache_1.3.12/src/os/unix -I/temp/php-4.0.1pl2/Ze nd -I/temp/php-4.0.1pl2 -I/usr/local/mysql/include/mysql -I/temp/php-4.0.1pl2/ext/xml/expat/xm ltok -I/temp/php-4.0.1pl2/ext/xml/expat/xmlparse -DXML_BYTE_ORDER=21 -g -O2 -c main.c && tou ch main.lo main.c: In function `php_error_cb': main.c:370: incompatible types in assignment main.c:435: incompatible types in assignment make[2]: *** [main.lo] Error 1 make[2]: Leaving directory `/temp/php-4.0.1pl2/main' make[1]: *** [all-recursive] Error 1 make[1]: Leaving directory `/temp/php-4.0.1pl2/main' make: *** [all-recursive] Error 1 --- HERE ENDS WITH ERROR --- [root@localhost php-4.0.1pl2]#

« previous php.dev (#30802) next »