PHP 4.0 Bug #6548: cvs broken

From: Date: Tue, 05 Sep 2000 11:18:58 +0000
Subject: PHP 4.0 Bug #6548: cvs broken
Groups: php.dev 
Request: Send a blank email to php-dev+get-32120@lists.php.net to get a copy of this message
From: wico@cnh.nl Operating system: linux rh6 PHP version: 4.0 Latest CVS (05/09/2000) PHP Bug Type: Compile Failure Bug description: cvs broken <=== src/modules/ssl ===> src/modules/php4 gcc -c -I../../os/unix -I../../include -I/usr/local/ssl/include -DLINUX=2 -DTARGET=\"httpsd\" -I/usr/src/php4 -I/usr/src/php4/main -I/usr/src/php4/main -I/usr/src/php4/Zend -I/usr/src/php4/Zend -I/usr/src/php4 -DUSE_EXPAT -I../../lib/expat-lite -DNO_DL_NEEDED -DAPACHE_SSL ../../apaci mod_php4.c In file included from mod_php4.c:29: /usr/src/php4/main/php.h:294: tsrm_virtual_cwd.h: No such file or directory make[4]: *** [mod_php4.o] Error 1 make[3]: *** [all] Error 1 make[2]: *** [subdirs] Error 1 make[2]: Leaving directory `/usr/src/apache_1.3.12/src' make[1]: *** [build-std] Error 2 make[1]: Leaving directory `/usr/src/apache_1.3.12' make: *** [build] Error 2 greetz, wico

« previous php.dev (#32120) next »