PHP 4.0 Bug #6548 Updated: cvs broken

From: Date: Wed, 06 Sep 2000 00:14:30 +0000
Subject: PHP 4.0 Bug #6548 Updated: cvs broken
Groups: php.dev 
Request: Send a blank email to php-dev+get-32275@lists.php.net to get a copy of this message
ID: 6548 Updated by: sniper Reported By: wico@cnh.nl Status: Closed Bug Type: Compile Failure Assigned To: Comments: Please do a new checkout (to be sure) of php4, Zend and TSRM. And in the future please use php-dev@lists.php.net for this kind of 'bug' reports. Thank you. --Jani Previous Comments: [2000-09-05 07:18:58] wico@cnh.nl <=== src/modules/ssl ===> src/modules/php4 gcc -c -I../../os/unix -I../../include -I/usr/local/ssl/include -DLINUX=2 -DTARGET="httpsd" -I/usr/src/php4 -I/usr/src/php4/main -I/usr/src/php4/main -I/usr/src/php4/Zend -I/usr/src/php4/Zend -I/usr/src/php4 -DUSE_EXPAT -I../../lib/expat-lite -DNO_DL_NEEDED -DAPACHE_SSL ../../apaci mod_php4.c In file included from mod_php4.c:29: /usr/src/php4/main/php.h:294: tsrm_virtual_cwd.h: No such file or directory make[4]: *** [mod_php4.o] Error 1 make[3]: *** [all] Error 1 make[2]: *** [subdirs] Error 1 make[2]: Leaving directory `/usr/src/apache_1.3.12/src' make[1]: *** [build-std] Error 2 make[1]: Leaving directory `/usr/src/apache_1.3.12' make: *** [build] Error 2 greetz, wico --------------------------------------------------------------------------- Full Bug description available at: http://bugs.php.net/?id=6548

« previous php.dev (#32275) next »