PHP 4.0 Bug #6832: oci8 compilation failure

From: Date: Thu, 21 Sep 2000 15:22:40 +0000
Subject: PHP 4.0 Bug #6832: oci8 compilation failure
Groups: php.dev 
Request: Send a blank email to php-dev+get-33485@lists.php.net to get a copy of this message
From: gim@forsyth-partners.co.uk Operating system: Linux (kernel 2.4.0-test7) RH 6.2 PHP version: 4.0.2 PHP Bug Type: Compile Failure Bug description: oci8 compilation failure Configuration --with-oci8 , etc, etc without any problem; make install produced: /bin/sh /root/build/php-4.0.2/libtool --silent --mode=compile gcc -I. -I/root/build/php-4.0.2/main -I/root/build/php-4.0.2 -I/root/build/php-4.0.2/main -I/usr/local/apache/include -I/root/build/php-4.0.2/Zend -I/root/build/php-4.0.2 -I/root/build/php-4.0.2/ext/mysql/libmysql -I/opt/oracle/product/8.1.6/rdbms/demo -I/root/build/php-4.0.2/ext/xml/expat/xmltok -I/root/build/php-4.0.2/ext/xml/expat/xmlparse -DEAPI=1 -DXML_BYTE_ORDER=12 -g -O2 -c internal_functions.c In file included from internal_functions.c:39: /root/build/php-4.0.2/ext/oci8/php_oci8.h:45: oci.h: No such file or directory make[2]: *** [internal_functions.lo] Error 1 make[2]: Leaving directory `/root/build/php-4.0.2/main' make[1]: *** [install-recursive] Error 1 make[1]: Leaving directory `/root/build/php-4.0.2/main' make: *** [install-recursive] Error 1

« previous php.dev (#33485) next »