Bug #1036: Failure when compiling Apache 1.33+PHP 3.0.6+sybase-ct
| From: | pascal dot deville at wanadoo dot fr | Date: | Wed, 06 Jan 1999 22:02:28 +0000 |
| Subject: | Bug #1036: Failure when compiling Apache 1.33+PHP 3.0.6+sybase-ct | ||
| Groups: | php.dev | ||
| Request: | Send a blank email to php-dev+get-3349@lists.php.net to get a copy of this message | ||
From: pascal.deville@wanadoo.fr
Operating system: Linux 2.0.34-36
PHP version: 3.0.6
PHP Bug Type: Compile Failure
Bug description: Failure when compiling Apache 1.33+PHP 3.0.6+sybase-ct
Result when compiling Apache 1.3.3 with PHP 3.0.6 as a module with sybase-ct
./configure --compat --prefix=/usr/local/apache --activate-module=src/modules/php3/libphp3.a
make
gcc -DLINUX=2 -DUSE_HSREGEX
./apaci \
-o httpd buildmark.o modules.o modules/standard/libstandard.a modules/php3/libphp3.a
main/libmain.a ./os/unix/libos.a ap/libap.a regex/libregex.a -Lmodules/php3 -L../modules/php3
-L../../modules/php3 -lmodphp3 -lgdbm -L/usr/local/sybase/lib -lcs -lct -lcomn -lintl -lsybtcl
-linsck -lm -ldl -lm
gcc: Internal compiler error: program ld got fatal signal 11
make[2]: *** [target_static] Error 1
make[2]: Leaving directory `/home/src/apache_1.3.3/src'
make[1]: *** [build-std] Error 2
make[1]: Leaving directory `/home/src/apache_1.3.3'
make: *** [build] Error 2
------------------
making of PHP
./configure --with-apache=/home/src/apache --with-gd=no --with-sybase-ct=/usr/local/sybase
--with-config-file-path --enable-debug=no --enable-track-vars=yes
This happens on different Linux boxes (different kernels,libc5 or libc6)
--
PHP Development Mailing List http://www.php.net/
To unsubscribe send an empty message to php-dev-unsubscribe@lists.php.net
For help: php-dev-help@lists.php.net