PHP 4.0 Bug #6246 Updated: Make error
| From: | Bug Database | Date: | Thu, 21 Sep 2000 14:09:50 +0000 |
| Subject: | PHP 4.0 Bug #6246 Updated: Make error | ||
| Groups: | php.dev | ||
| Request: | Send a blank email to php-dev+get-33558@lists.php.net to get a copy of this message | ||
ID: 6246
Updated by: sniper
Reported By: will@tempestdigital.com
Status: Closed
Bug Type: *General Issues
Assigned To:
Comments:
Previous Comments:
---------------------------------------------------------------------------
[2000-08-21 18:16:42] will@tempestdigital.com
I now get this message...
Making all in Zend
make[1]: Entering directory `/tmp/php-4.0.1pl2/Zend'
/bin/sh ../libtool --silent --mode=compile gcc -DHAVE_CONFIG_H -I. -I. -I.. -D
EAPI=1 -DXML_BYTE_ORDER=12 -g -O2 -c zend-scanner.c
./zend-scanner.l: In function `lex_scan':
./zend-scanner.l:1136: `ERANGE' undeclared (first use in this function)
./zend-scanner.l:1136: (Each undeclared identifier is reported only once
./zend-scanner.l:1136: for each function it appears in.)
make[1]: *** [zend-scanner.lo] Error 1
make[1]: Leaving directory `/tmp/php-4.0.1pl2/Zend'
make: *** [all-recursive] Error
---------------------------------------------------------------------------
[2000-08-18 14:58:43] will@tempestdigital.com
I get the following error after a make command...
Making all in Zend
make[1]: Entering directory `/tmp/php-4.0.1pl2/Zend'
/bin/sh ../libtool --silent --mode=compile gcc -DHAVE_CONFIG_H -I. -I. -I.. -D
EAPI=1 -DXML_BYTE_ORDER=12 -g -O2 -c zend-scanner.c
In file included from /usr/include/errno.h:36,
from ./zend-scanner.l:40:
/usr/include/bits/errno.h:25: linux/errno.h: No such file or directory
make[1]: *** [zend-scanner.lo] Error 1
make[1]: Leaving directory `/tmp/php-4.0.1pl2/Zend'
make: *** [all-recursive] Error 1
Here is the ./configure line:
./configure --with-apxs=/usr/sbin/apxs --with-mysql=/u
sr --enable-magic-quotes
Haven't the slightest idea what seems to be the problem...
---------------------------------------------------------------------------
Full Bug description available at: http://bugs.php.net/?id=6246