PHP 4.0 Bug #6876: Error when using Make after successful ./configure ......

From: Date: Mon, 25 Sep 2000 05:24:47 +0000
Subject: PHP 4.0 Bug #6876: Error when using Make after successful ./configure ......
Groups: php.dev 
Request: Send a blank email to php-dev+get-33631@lists.php.net to get a copy of this message
From: kamransaleem@mail.com Operating system: Redhat Linux PHP version: 4.0.2 PHP Bug Type: *Install and Config Bug description: Error when using Make after successful ./configure ...... Below is the information pasted I am getting error when i use to configure PHP for my webserver when i use make after running ./configure --with-apxs=/usr/local/apache/bin/apxs --with-config-file-path=/etc/httpd --with-mysql --with-system-regex make and got following error at the end TE_ORDER=12 -g -O2 -c posix.c /bin/sh /tmp/php-4.0.2/libtool --silent --mode=link gcc -I. -I/tmp/php-4.0.2/ext/posix -I/tmp/php-4.0.2 -I/tmp/php-4.0.2/main -I/usr/local/apache/include -I/tmp/php-4.0.2/Zend -I/tmp/php-4.0.2 -I/tmp/php-4.0.2/ext/mysql/libmysql -I/tmp/php-4.0.2/ext/xml/expat/xmltok -I/tmp/php-4.0.2/ext/xml/expat/xmlparse -DXML_BYTE_ORDER=12 -g -O2 -o libposix.la posix.lo make[3]: Leaving directory /tmp/php-4.0.2/ext/posix' make[2]: Leaving directory /tmp/php-4.0.2/ext/posix' Making all in session make[2]: Entering directory /tmp/php-4.0.2/ext/session' make[3]: Entering directory /tmp/php-4.0.2/ext/session' /bin/sh /tmp/php-4.0.2/libtool --silent --mode=compile gcc -I. -I/tmp/php-4.0.2/ext/session -I/tmp/php-4.0.2 -I/tmp/php-4.0.2/main -I/usr/local/apache/include -I/tmp/php-4.0.2/Zend -I/tmp/php-4.0.2 -I/tmp/php-4.0.2/ext/mysql/libmysql -I/tmp/php-4.0.2/ext/xml/expat/xmltok -I/tmp/php-4.0.2/ext/xml/expat/xmlparse -DXML_BYTE_ORDER=12 -g -O2 -c session.c gcc: Internal compiler error: program cc1 got fatal signal 11 make[3]: *** [session.lo] Error 1 make[3]: Leaving directory /tmp/php-4.0.2/ext/session' make[2]: *** [all-recursive] Error 1 make[2]: Leaving directory /tmp/php-4.0.2/ext/session' make[1]: *** [all-recursive] Error 1 make[1]: Leaving directory /tmp/php-4.0.2/ext' make: *** [all-recursive] Error 1 [root@localhost php-4.0.2]# Please do solve and let me know what is the Problem Thanks in advance, Kamran Saleem KamranSaleem@mai.com

« previous php.dev (#33631) next »