PHP 4.0 Bug #7201 Updated: make fails
| From: | Bug Database | Date: | Sat, 14 Oct 2000 02:06:16 +0000 |
| Subject: | PHP 4.0 Bug #7201 Updated: make fails | ||
| Groups: | php.dev | ||
| Request: | Send a blank email to php-dev+get-34970@lists.php.net to get a copy of this message | ||
ID: 7201
Updated by: sniper
Reported By: dan@tucny.com
Status: Closed
Bug Type: Compile Failure
Assigned To:
Comments:
See:
http://www.php.net/FAQ.php#6.12
Previous Comments:
---------------------------------------------------------------------------
[2000-10-13 21:33:44] dan@tucny.com
/bin/sh /home/dan/php-4.0.3/libtool --silent --mode=compile gcc -I.
-I/home/dan/php-4.0.3/ext/standard -I/home/dan/php-4.0.3 -I/home/dan/php-4.0.3/main
-I/usr/include/apache -I/home/dan/php-4.0.3/Zend -I/home/dan/php-4.0.3
-I/home/dan/php-4.0.3/ext/mysql/libmysql -I/home/dan/php-4.0.3/ext/xml/expat/xmltok
-I/home/dan/php-4.0.3/ext/xml/expat/xmlparse -I/home/dan/php-4.0.3/TSRM -DXML_BYTE_ORDER=12 -g -O2
-c microtime.c
microtime.c: In function `php_if_getrusage':
microtime.c:97: storage size of `usg' isn't known
microtime.c:100: `RUSAGE_SELF' undeclared (first use in this function)
microtime.c:100: (Each undeclared identifier is reported only once
microtime.c:100: for each function it appears in.)
microtime.c:106: `RUSAGE_CHILDREN' undeclared (first use in this function)
make[3]: *** [microtime.lo] Error 1
make[3]: Leaving directory `/home/dan/php-4.0.3/ext/standard'
make[2]: *** [all-recursive] Error 1
make[2]: Leaving directory `/home/dan/php-4.0.3/ext/standard'
make[1]: *** [all-recursive] Error 1
make[1]: Leaving directory `/home/dan/php-4.0.3/ext'
make: *** [all-recursive] Error 1
php4.0.1pl2 compiles ok
---------------------------------------------------------------------------
Full Bug description available at: http://bugs.php.net/?id=7201