PHP 4.0 Bug #6832 Updated: oci8 compilation failure
| From: | sniper@php.net | Date: | Mon, 16 Oct 2000 14:30:02 +0000 |
| Subject: | PHP 4.0 Bug #6832 Updated: oci8 compilation failure | ||
| Groups: | php.dev | ||
| Request: | Send a blank email to php-dev+get-35129@lists.php.net to get a copy of this message | ||
ID: 6832
Updated by: sniper
Reported By: gim@forsyth-partners.co.uk
Status: Feedback
Bug Type: Compile Failure
Assigned To:
Comments:
What was the full configure line you used?
Did you have ORACLE_HOME defined?
--Jani
Previous Comments:
---------------------------------------------------------------------------
[2000-09-21 11:22:40] gim@forsyth-partners.co.uk
Configuration --with-oci8 , etc, etc without any problem;
make install produced:
/bin/sh /root/build/php-4.0.2/libtool --silent --mode=compile gcc -I. -I/root/build/php-4.0.2/main
-I/root/build/php-4.0.2 -I/root/build/php-4.0.2/main -I/usr/local/apache/include
-I/root/build/php-4.0.2/Zend -I/root/build/php-4.0.2 -I/root/build/php-4.0.2/ext/mysql/libmysql
-I/opt/oracle/product/8.1.6/rdbms/demo -I/root/build/php-4.0.2/ext/xml/expat/xmltok
-I/root/build/php-4.0.2/ext/xml/expat/xmlparse -DEAPI=1 -DXML_BYTE_ORDER=12 -g -O2 -c
internal_functions.c
In file included from internal_functions.c:39:
/root/build/php-4.0.2/ext/oci8/php_oci8.h:45: oci.h: No such file or directory
make[2]: *** [internal_functions.lo] Error 1
make[2]: Leaving directory `/root/build/php-4.0.2/main'
make[1]: *** [install-recursive] Error 1
make[1]: Leaving directory `/root/build/php-4.0.2/main'
make: *** [install-recursive] Error 1
---------------------------------------------------------------------------
Full Bug description available at: http://bugs.php.net/?id=6832