PHP 4.0 Bug #7188 Updated: Cannot compile sockets

From: Date: Sun, 22 Oct 2000 08:09:03 +0000
Subject: PHP 4.0 Bug #7188 Updated: Cannot compile sockets
Groups: php.dev 
Request: Send a blank email to php-dev+get-35756@lists.php.net to get a copy of this message
ID: 7188 Updated by: chrisv Reported By: dirk@net-communication.de Status: Assigned Bug Type: Compile Failure Assigned To: chrisv Comments: Try downloading the current CVS and compiling again. If that doesn't solve your problems, please reply ASAP. Previous Comments: --------------------------------------------------------------------------- [2000-10-13 12:03:57] dirk@net-communication.de When compiling PHP 4.0.3 (or even 4.0.2) with: ./configure --with-mysql --with-apache=../apache_1.3.12 --enable-sockets --enable-track-vars the compilation stops during "make": sockets.c: In function `php_minit_sockets': sockets.c:189: `MSG_WAITALL' undeclared (first use in this function) sockets.c:189: (Each undeclared identifier is reported only once sockets.c:189: for each function it appears in.) sockets.c:201: `SO_SNDLOWAT' undeclared (first use in this function) sockets.c:202: `SO_RCVLOWAT' undeclared (first use in this function) sockets.c:203: `SO_SNDTIMEO' undeclared (first use in this function) sockets.c:204: `SO_RCVTIMEO' undeclared (first use in this function) make[3]: *** [sockets.lo] Error 1 make[3]: Leaving directory `/usr/src/php-4.0.3/ext/sockets' make[2]: *** [all-recursive] Error 1 make[2]: Leaving directory `/usr/src/php-4.0.3/ext/sockets' make[1]: *** [all-recursive] Error 1 make[1]: Leaving directory `/usr/src/php-4.0.3/ext' make: *** [all-recursive] Error 1 --------------------------------------------------------------------------- Full Bug description available at: http://bugs.php.net/?id=7188

« previous php.dev (#35756) next »