PHP 4.0 Bug #7682 Updated: ./zend-scanner.l:1002: `ERANGE' undeclared
| From: | gallard dot nicolas at cimaest dot msa dot fr | Date: | Tue, 07 Nov 2000 16:23:11 +0000 |
| Subject: | PHP 4.0 Bug #7682 Updated: ./zend-scanner.l:1002: `ERANGE' undeclared | ||
| Groups: | php.dev | ||
| Request: | Send a blank email to php-dev+get-37361@lists.php.net to get a copy of this message | ||
ID: 7682
User Update by: gallard.nicolas@cimaest.msa.fr
Status: Open
Bug Type: Compile Problem
Description: ./zend-scanner.l:1002: `ERANGE' undeclared
In compiling, i have this error :
[root@linux php-4.0.2]# ./configure ---> it's OK (i thinks)
[root@linux php-4.0.2]# make
Making all in Zend
make[1]: Entering directory `/usr/local/src/php-4.0.2/Zend'
/bin/sh ../libtool --silent --mode=compile gcc -DHAVE_CONFIG_H -I. -I. -I.. -D
XML_BYTE_ORDER=12 -g -O2 -c zend-scanner.c
./zend-scanner.l: In function `lex_scan':
./zend-scanner.l:1002: `ERANGE' undeclared (first use in this function)
./zend-scanner.l:1002: (Each undeclared identifier is reported only once
./zend-scanner.l:1002: for each function it appears in.)
make[1]: *** [zend-scanner.lo] Error 1
make[1]: Leaving directory `/usr/local/src/php-4.0.2/Zend'
make: *** [all-recursive] Error 1
Previous Comments:
---------------------------------------------------------------------------
[2000-11-07 16:36:26] gallard.nicolas@cimaest.msa.fr
In compiling, i have this error :
[root@linux php-4.0.2]# ./configure ---> it's OK (i things)
[root@linux php-4.0.2]# make
Making all in Zend
make[1]: Entering directory `/usr/local/src/php-4.0.2/Zend'
/bin/sh ../libtool --silent --mode=compile gcc -DHAVE_CONFIG_H -I. -I. -I.. -D
XML_BYTE_ORDER=12 -g -O2 -c zend-scanner.c
./zend-scanner.l: In function `lex_scan':
./zend-scanner.l:1002: `ERANGE' undeclared (first use in this function)
./zend-scanner.l:1002: (Each undeclared identifier is reported only once
./zend-scanner.l:1002: for each function it appears in.)
make[1]: *** [zend-scanner.lo] Error 1
make[1]: Leaving directory `/usr/local/src/php-4.0.2/Zend'
make: *** [all-recursive] Error 1
---------------------------------------------------------------------------
Full Bug description available at: http://bugs.php.net/?id=7682