PHP 4.0 Bug #7682 Updated: ./zend-scanner.l:1002: `ERANGE' undeclared

From: Date: Wed, 08 Nov 2000 00:04:57 +0000
Subject: PHP 4.0 Bug #7682 Updated: ./zend-scanner.l:1002: `ERANGE' undeclared
Groups: php.dev 
Request: Send a blank email to php-dev+get-37402@lists.php.net to get a copy of this message
ID: 7682 Updated by: sniper Reported By: gallard.nicolas@cimaest.msa.fr Status: Closed Bug Type: Compile Problem Assigned To: Comments: See #6415 (And please upgrade to PHP4.0.3pl1 !) --Jani Previous Comments: --------------------------------------------------------------------------- [2000-11-07 17:23:11] gallard.nicolas@cimaest.msa.fr In compiling, i have this error : [root@linux php-4.0.2]# ./configure ---> it's OK (i thinks) [root@linux php-4.0.2]# make Making all in Zend make[1]: Entering directory `/usr/local/src/php-4.0.2/Zend' /bin/sh ../libtool --silent --mode=compile gcc -DHAVE_CONFIG_H -I. -I. -I.. -D XML_BYTE_ORDER=12 -g -O2 -c zend-scanner.c ./zend-scanner.l: In function `lex_scan': ./zend-scanner.l:1002: `ERANGE' undeclared (first use in this function) ./zend-scanner.l:1002: (Each undeclared identifier is reported only once ./zend-scanner.l:1002: for each function it appears in.) make[1]: *** [zend-scanner.lo] Error 1 make[1]: Leaving directory `/usr/local/src/php-4.0.2/Zend' make: *** [all-recursive] Error 1 --------------------------------------------------------------------------- [2000-11-07 16:36:26] gallard.nicolas@cimaest.msa.fr In compiling, i have this error : [root@linux php-4.0.2]# ./configure ---> it's OK (i things) [root@linux php-4.0.2]# make Making all in Zend make[1]: Entering directory `/usr/local/src/php-4.0.2/Zend' /bin/sh ../libtool --silent --mode=compile gcc -DHAVE_CONFIG_H -I. -I. -I.. -D XML_BYTE_ORDER=12 -g -O2 -c zend-scanner.c ./zend-scanner.l: In function `lex_scan': ./zend-scanner.l:1002: `ERANGE' undeclared (first use in this function) ./zend-scanner.l:1002: (Each undeclared identifier is reported only once ./zend-scanner.l:1002: for each function it appears in.) make[1]: *** [zend-scanner.lo] Error 1 make[1]: Leaving directory `/usr/local/src/php-4.0.2/Zend' make: *** [all-recursive] Error 1 --------------------------------------------------------------------------- Full Bug description available at: http://bugs.php.net/?id=7682

« previous php.dev (#37402) next »