PHP 4.0 Bug #7690: Compile failure in DOM-XML
| From: | graeme at inetix dot com dot au | Date: | Wed, 08 Nov 2000 00:48:17 +0000 |
| Subject: | PHP 4.0 Bug #7690: Compile failure in DOM-XML | ||
| Groups: | php.dev | ||
| Request: | Send a blank email to php-dev+get-37404@lists.php.net to get a copy of this message | ||
From: graeme@inetix.com.au
Operating system: Linux i386 2.2.14
PHP version: 4.0 Latest CVS (08/11/2000)
PHP Bug Type: Compile Failure
Bug description: Compile failure in DOM-XML
RedHat 6.2 with libxml2-2.2.7-1.i386.rpm and libxml2-devel-2.2.7-1.i386.rpm from Gnome FTP server.
Configure line:
./configure '--with-mysql=/usr/local/mysql'
'--with-oci8=/u01/app/oracle/product/8.1.5' '--disable-debug'
'--enable-magic-quotes' '--without-gd' '--enable-memory-limit'
'--enable-sigchild' '--with-dom'
Configure output:
checking for DOM support... yes
checking for DOM in default path... found in /usr
Make output:
gcc -I. -I/usr/local/src/phpcvs/php4/ext/domxml -I/usr/local/src/phpcvs/php4
-I/usr/local/src/phpcvs/php4/main -I/usr/local/src/phpcvs/php4/Zend -I/usr/local/src/phpcvs/php4
-I/usr/local/mysql/include/mysql -I/u01/app/oracle/product/8.1.5/rdbms/demo
-I/u01/app/oracle/product/8.1.5/network/public -I/u01/app/oracle/product/8.1.5/plsql/public
-I/usr/local/src/phpcvs/php4/ext/xml/expat/xmltok
-I/usr/local/src/phpcvs/php4/ext/xml/expat/xmlparse -I/usr/local/src/phpcvs/php4/TSRM
-DXML_BYTE_ORDER=12 -g -O2 -c php_domxml.c && touch php_domxml.lo
php_domxml.c: In function `php_minit_domxml':
php_domxml.c:168: `XML_GLOBAL_NAMESPACE' undeclared (first use in this function)
php_domxml.c:168: (Each undeclared identifier is reported only once
php_domxml.c:168: for each function it appears in.)
make[3]: *** [php_domxml.lo] Error 1
make[3]: Leaving directory `/usr/local/src/phpcvs/php4/ext/domxml'
make[2]: *** [all-recursive] Error 1
make[2]: Leaving directory `/usr/local/src/phpcvs/php4/ext/domxml'
make[1]: *** [all-recursive] Error 1
make[1]: Leaving directory `/usr/local/src/phpcvs/php4/ext'
make: *** [all-recursive] Error 1
--
Edit Bug report at: http://bugs.php.net/?id=7690&edit=1