PHP 4.0 Bug #8031 Updated: I can't MAKE php

From: Date: Wed, 29 Nov 2000 11:23:48 +0000
Subject: PHP 4.0 Bug #8031 Updated: I can't MAKE php
Groups: php.dev 
Request: Send a blank email to php-dev+get-39507@lists.php.net to get a copy of this message
ID: 8031 Updated by: sniper Reported By: tom.freeman@niss.ac.uk Status: Closed Bug Type: Compile Failure Assigned To: Comments: This is fixed already in CVS. Please try a snapshot from http://snaps.php.net/ and if it doesn't work for you, reopen this bug report. --Jani Previous Comments: --------------------------------------------------------------------------- [2000-11-29 06:09:27] tom.freeman@niss.ac.uk Hi, I don't know if the problem is anything to do with php, or the setup I'm trying to install it on. First I ran the following configure statement: ./configure --with-mysql=../mysql --with-apache=../apache_1.3.14 --enable-track-vars This worked fine. Then I ran MAKE, and it all looked fine until I got the message: "reentrancy.c", line 106: prototype mismatch: 2 args passed, 3 expected cc: acomp failed for reentrancy.c make[2]: *** [reentrancy.lo] Error 2 make[2]: Leaving directory `/export/home/tdf/php-4.0.3pl1/main' make[1]: *** [all-recursive] Error 1 make[1]: Leaving directory `/export/home/tdf/php-4.0.3pl1/main' make: *** [all-recursive] Error 1 I am running UNIX on a Sun Solaris machine. I am compiling the program using: cc: WorkShop Compilers 4.2 30 Oct 1996 C 4.2 Any ideas why this isn't working? cheers, Tom. p.s. I love those pop out boxes, very cool! there on my site now as well:) --------------------------------------------------------------------------- Full Bug description available at: http://bugs.php.net/?id=8031

« previous php.dev (#39507) next »