PHP 4.0 Bug #5534 Updated: conflicting types for dlerror

From: Date: Wed, 29 Nov 2000 12:17:43 +0000
Subject: PHP 4.0 Bug #5534 Updated: conflicting types for dlerror
Groups: php.dev 
Request: Send a blank email to php-dev+get-39563@lists.php.net to get a copy of this message
ID: 5534 Updated by: sniper Reported By: darren@bmv.state.me.us Status: Bogus Bug Type: *General Issues Assigned To: Comments: Previous Comments: --------------------------------------------------------------------------- [2000-07-12 14:16:42] darren@bmv.state.me.us Very simple compile.... --with-mysql=/the/right/path --with-apxs=/theother/right/path This is the same problem as detailed in bug #5236 which was filed for 4.0.0 To wit.... gmake[1]: Entering directory `/home/darren/Temp/php-4.0.1pl2/sapi' Making all in apache gmake[2]: Entering directory `/home/darren/Temp/php-4.0.1pl2/sapi/apache' gmake[3]: Entering directory `/home/darren/Temp/php-4.0.1pl2/sapi/apache' /bin/sh /home/darren/Temp/php-4.0.1pl2/libtool --silent --mode=compile gcc -DHAV E_CONFIG_H -I. -I/home/darren/Temp/php-4.0.1pl2/sapi/apache -I/home/darren/Temp/ php-4.0.1pl2 -I/home/darren/Temp/php-4.0.1pl2/main -I/usr/local/apache/include - I/home/darren/Temp/php-4.0.1pl2/Zend -I/home/darren/Temp/php-4.0.1pl2 -I/usr/loc al/mysql/include/mysql -I/home/darren/Temp/php-4.0.1pl2/ext/xml/expat/xmltok -I/ home/darren/Temp/php-4.0.1pl2/ext/xml/expat/xmlparse -DXML_BYTE_ORDER=21 -O2 - c sapi_apache.c In file included from /usr/local/apache/include/ap_config.h:116, from /usr/local/apache/include/httpd.h:71, from sapi_apache.c:32: /usr/local/apache/include/os.h:122: conflicting types for `dlerror' /usr/include/dlfcn.h:35: previous declaration of `dlerror' gmake[3]: *** [sapi_apache.lo] Error 1 gmake[3]: Leaving directory `/home/darren/Temp/php-4.0.1pl2/sapi/apache' gmake[2]: *** [all-recursive] Error 1 gmake[2]: Leaving directory `/home/darren/Temp/php-4.0.1pl2/sapi/apache' gmake[1]: *** [all-recursive] Error 1 gmake[1]: Leaving directory `/home/darren/Temp/php-4.0.1pl2/sapi' gmake: *** [all-recursive] Error 1 --------------------------------------------------------------------------- Full Bug description available at: http://bugs.php.net/?id=5534

« previous php.dev (#39563) next »