Unresolved text symbol error with php-4.0.3pl1,apache_1.3.14 and IRIX
| From: | Rene Salmon | Date: | Mon, 11 Dec 2000 17:03:55 +0000 |
| Subject: | Unresolved text symbol error with php-4.0.3pl1,apache_1.3.14 and IRIX | ||
| Groups: | php.dev php.install | ||
| Request: | Send a blank email to php-dev+get-40867@lists.php.net to get a copy of this message | ||
Hello all,
I been looking all over the mailing list archives and the web for
someone who may have posted a solution to this problem but had no luck.
Pleeeeease help me!!!!!
I have an IRIX server running irix 6.5.9. I have apache_1.3.14 compiled
and installed using the IRIX CC compiler not gcc this is of course with
out php. I also have mysql-3.22.32 compiled and installed with no
problem.
I was able to configure, compile and install php on my system. The
problem comes when I try to recompile apache to add the static php module.
Here is where it fails after I type make. From what I found on the mail
archives this is a problem with how the inline functions are defined or
used not really sure which.
Does anyone have any idea on how I can get this to compile???????
Thank you for any advice or help you can give me.
Rene
<=== src/modules/php4
gmake[3]: Leaving directory
`/bad_disk_root/src/apache/apache_1.3.14/src/modules'
<=== src/modules
cc -c -I./os/unix -I./include -exceptions -DIRIX -n32
-I/bad_disk_root/src/php/ph
p-4.0.3pl1 -I/bad_disk_root/src/php/php-4.0.3pl1/main
-I/bad_disk_root/src/php/php-4
.0.3pl1/main -I/bad_disk_root/src/php/php-4.0.3pl1/Zend
-I/bad_disk_root/src/php/php
-4.0.3pl1/Zend -I/bad_disk_root/src/php/php-4.0.3pl1/TSRM
-I/bad_disk_root/src/php/p
hp-4.0.3pl1/TSRM -I/bad_disk_root/src/php/php-4.0.3pl1 -DUSE_EXPAT
-I./lib/expat-lit
e -DNO_DL_NEEDED
./apaci modules.c
cc -c -I./os/unix -I./include -exceptions -DIRIX -n32
-I/bad_disk_root/src/php/ph
p-4.0.3pl1 -I/bad_disk_root/src/php/php-4.0.3pl1/main
-I/bad_disk_root/src/php/php-4
.0.3pl1/main -I/bad_disk_root/src/php/php-4.0.3pl1/Zend
-I/bad_disk_root/src/php/php
-4.0.3pl1/Zend -I/bad_disk_root/src/php/php-4.0.3pl1/TSRM
-I/bad_disk_root/src/php/p
hp-4.0.3pl1/TSRM -I/bad_disk_root/src/php/php-4.0.3pl1 -DUSE_EXPAT
-I./lib/expat-lit
e -DNO_DL_NEEDED ./apaci buildmark.c
cc -exceptions -DIRIX -n32 -I/bad_disk_root/src/php/php-4.0.3pl1
-I/bad_disk_root/s
rc/php/php-4.0.3pl1/main -I/bad_disk_root/src/php/php-4.0.3pl1/main
-I/bad_disk_root
/src/php/php-4.0.3pl1/Zend -I/bad_disk_root/src/php/php-4.0.3pl1/Zend
-I/bad_disk_ro
ot/src/php/php-4.0.3pl1/TSRM -I/bad_disk_root/src/php/php-4.0.3pl1/TSRM
-I/bad_disk_
root/src/php/php-4.0.3pl1 -DUSE_EXPAT -I./lib/expat-lite -DNO_DL_NEEDED
./apaci -n
32 \
-o httpd buildmark.o modules.o modules/php4/libphp4.a
modules/standard/libstan
dard.a main/libmain.a ./os/unix/libos.a ap/libap.a
lib/expat-lite/libexpat.a -Wl,-
rpath,/usr/local/lib/mysql -L/usr/local/lib/mysql -Lmodules/php4
-L../modules/php4
-L../../modules/php4 -lmodphp4 -ldl -lmysqlclient -lm -ldl -lcrypt
-lsocket -lsoc
ket
ld32: WARNING 84 : modules/php4/libmodphp4.a is not used for resolving any
symbol.
ld32: WARNING 84 : /usr/lib32/libdl.so is not used for resolving any
symbol.
ld32: WARNING 84 : /usr/lib32/libsocket.so is not used for resolving any
symbol.
ld32: ERROR 33 : Unresolved text symbol "_array_init" -- 1st referenced
by modules
/php4/libphp4.a(main.o).
Use linker option -v to see when and which objects, archives and
dsos are lo
aded.
ld32: ERROR 33 : Unresolved text symbol "zend_ptr_stack_push" -- 1st
referenced by
modules/php4/libphp4.a(zend_execute_API.o).
Use linker option -v to see when and which objects, archives and
dsos are lo
aded.
ld32: ERROR 33 : Unresolved text symbol "var_reset" -- 1st referenced by
modules/p
hp4/libphp4.a(zend_operators.o).
Use linker option -v to see when and which objects, archives and
dsos are lo
aded.
ld32: ERROR 33 : Unresolved text symbol "add_get_index_string" -- 1st
referenced b
y modules/php4/libphp4.a(zend_builtin_functions.o).
Use linker option -v to see when and which objects, archives and
dsos are lo
aded.
ld32: ERROR 33 : Unresolved text symbol "add_get_index_long" -- 1st
referenced by
modules/php4/libphp4.a(zend_builtin_functions.o).
Use linker option -v to see when and which objects, archives and
dsos are lo
aded.
ld32: ERROR 33 : Unresolved text symbol "add_next_index_string" -- 1st
referenced
by modules/php4/libphp4.a(zend_builtin_functions.o).
Use linker option -v to see when and which objects, archives and
dsos are lo
aded.
ld32: ERROR 33 : Unresolved text symbol "zend_ptr_stack_pop" -- 1st
referenced by
modules/php4/libphp4.a(zend_builtin_functions.o).
Use linker option -v to see when and which objects, archives and
dsos are lo
aded.
ld32: ERROR 33 : Unresolved text symbol "add_index_unset" -- 1st
referenced by mod
ules/php4/libphp4.a(php_mysql.o).
Use linker option -v to see when and which objects, archives and
dsos are lo
aded.
ld32: ERROR 33 : Unresolved text symbol "add_assoc_unset" -- 1st
referenced by mod
ules/php4/libphp4.a(php_mysql.o).
Use linker option -v to see when and which objects, archives and
dsos are lo
aded.
ld32: INFO 152: Output file removed because of error.
gmake[2]: *** [target_static] Error 2
gmake[2]: Leaving directory `/bad_disk_root/src/apache/apache_1.3.14/src'
gmake[1]: *** [build-std] Error 2
gmake[1]: Leaving directory `/bad_disk_root/src/apache/apache_1.3.14'
gmake: *** [build] Error 2
-
--
Rene Salmon
Tulane University
Department of Biomedical Engineering
Lindy Boggs, suite 500
New Orleans, LA 70118
Tel 504-865-5853
Fax 504-862-8779