PHP 4.0 Bug #8201: Compile failure with --enable-sockets

From: Date: Tue, 12 Dec 2000 00:19:33 +0000
Subject: PHP 4.0 Bug #8201: Compile failure with --enable-sockets
Groups: php.dev 
Request: Send a blank email to php-dev+get-40913@lists.php.net to get a copy of this message
From: youngd@digiship.com Operating system: Solaris 5.7 PHP version: 4.0.3pl1 PHP Bug Type: Compile Failure Bug description: Compile failure with --enable-sockets Happens with dist tarball as well as CVS source: Making all in sockets make[2]: Entering directory `/usr/local/build/php/php4/ext/sockets' make[3]: Entering directory `/usr/local/build/php/php4/ext/sockets' /bin/sh /usr/local/build/php/php4/libtool --silent --mode=compile gcc -I. -I/usr/local/build/php/php4/ext/sockets -I/usr/local/build/php/php4/main -I/usr/local/build/php/php4 -I/usr/local/apache/include -I/usr/local/build/php/php4/Zend -I/usr/local/build/php/php4/ext/mysql/libmysql -I/usr/local/build/php/php4/ext/xml/expat/xmltok -I/usr/local/build/php/php4/ext/xml/expat/xmlparse -I/usr/local/build/php/php4/TSRM -D_POSIX_PTHREAD_SEMANTICS -DSOLARIS2=270 -DUSE_EXPAT -DXML_BYTE_ORDER=21 -g -O2 -c sockets.c sockets.c: In function `php_if_recvmsg': sockets.c:1734: structure has no member named `msg_control' sockets.c:1735: structure has no member named `msg_controllen' sockets.c:1737: structure has no member named `msg_control' sockets.c:1738: structure has no member named `msg_controllen' sockets.c:1741: structure has no member named `msg_flags' sockets.c:1747: structure has no member named `msg_control' sockets.c:1756: warning: passing arg 3 of `add_assoc_string' makes pointer from integer without a cast sockets.c:1760: structure has no member named `msg_controllen' sockets.c:1761: structure has no member named `msg_flags' sockets.c:1793: structure has no member named `msg_control' sockets.c:1794: structure has no member named `msg_controllen' sockets.c:1796: structure has no member named `msg_control' sockets.c:1797: structure has no member named `msg_controllen' sockets.c:1800: structure has no member named `msg_flags' sockets.c:1806: structure has no member named `msg_control' sockets.c:1816: warning: passing arg 3 of `add_assoc_string' makes pointer from integer without a cast sockets.c:1818: structure has no member named `msg_controllen' sockets.c:1820: structure has no member named `msg_flags' make[3]: *** [sockets.lo] Error 1 make[3]: Leaving directory `/usr/local/build/php/php4/ext/sockets' make[2]: *** [all-recursive] Error 1 make[2]: Leaving directory `/usr/local/build/php/php4/ext/sockets' make[1]: *** [all-recursive] Error 1 make[1]: Leaving directory `/usr/local/build/php/php4/ext' make: *** [all-recursive] Error 1 -- Edit Bug report at: http://bugs.php.net/?id=8201&edit=1

« previous php.dev (#40913) next »