Bug #1155: unable to compile php3 and apache in aix 4.2 have already included the libld.a
| From: | jhicks at gannett dot gmti dot com | Date: | Wed, 17 Feb 1999 14:15:54 +0000 |
| Subject: | Bug #1155: unable to compile php3 and apache in aix 4.2 have already included the libld.a | ||
| Groups: | php.dev | ||
| Request: | Send a blank email to php-dev+get-4135@lists.php.net to get a copy of this message | ||
From: jhicks@gannett.gmti.com
Operating system: AIX 4.2
PHP version: 3.0.6
PHP Bug Type: Compile Failure
Bug description: unable to compile php3 and apache in aix 4.2 have already included the libld.a
unable to compile php3 and apache in aix 4.2 have already included the libld.a libdl.a in the
Configure.tmpl
(EXTRA_LIBS=-L/usr/ccs/lib -lld -L/usr/ccs/lib -ldl) but this doesn't seem to fix the problem.
??
<=== src/modules
gcc -c -I./os/unix -I./include -DAIX=42 -U__STR__ -DAIX_BIND_PROCESSOR
./apaci
modules.c
gcc -c -I./os/unix -I./include -DAIX=42 -U__STR__ -DAIX_BIND_PROCESSOR ./apaci
buildmark.c
gcc -DAIX=42 -U__STR__ -DAIX_BIND_PROCESSOR ./apaci -lm \
-o httpd buildmark.o modules.o modules/php3/libphp3.a modules/htdl/libhtdl.a
modules/standard/libstandard.a main/libmain.a ./os/unix/libos.a ap/libap.a -L/usr/ccs/lib -lld
-L/usr/ccs/lib -ldl -Lmodules/php3 -L../modules/php3 -L../../modules/php3 -lmodphp3
-lm -ldl -lnsl -Lmodules/htdl -L../modules/htdl -lmodhtdl
collect2: ld returned 8 exit status
ld: 0711-317 ERROR: Undefined symbol: .oclose
ld: 0711-317 ERROR: Undefined symbol: .ologof
ld: 0711-317 ERROR: Undefined symbol: .oerhms
ld: 0711-317 ERROR: Undefined symbol: .olog
ld: 0711-317 ERROR: Undefined symbol: .oopen
ld: 0711-317 ERROR: Undefined symbol: .ocon
ld: 0711-317 ERROR: Undefined symbol: .oparse
ld: 0711-317 ERROR: Undefined symbol: .obndra
ld: 0711-317 ERROR: Undefined symbol: .odescr
ld: 0711-317 ERROR: Undefined symbol: .odefin
ld: 0711-317 ERROR: Undefined symbol: .oexfet
ld: 0711-317 ERROR: Undefined symbol: .oexec
ld: 0711-317 ERROR: Undefined symbol: .obreak
ld: 0711-317 ERROR: Undefined symbol: .ofen
ld: 0711-317 ERROR: Undefined symbol: .oflng
ld: 0711-345 Use the -bloadmap or -bnoquiet option to obtain more information.
make[2]: *** [target_static] Error 1
make[2]: Leaving directory `/dot/dc4/apache_1.3.4/src'
make[1]: *** [build-std] Error 2
make[1]: Leaving directory `/dot/dc4/apache_1.3.4'
make: *** [build] Error 2
--
PHP Development Mailing List http://www.php.net/
To unsubscribe send an empty message to php-dev-unsubscribe@lists.php.net
For help: php-dev-help@lists.php.net