RE: PHP 4.0 Bug #8743 Updated: failure to compile when running make
| From: | Mark Harburn | Date: | Tue, 16 Jan 2001 19:34:29 +0000 |
| Subject: | RE: PHP 4.0 Bug #8743 Updated: failure to compile when running make | ||
| References: | 1 | Groups: | php.dev |
| Request: | Send a blank email to php-dev+get-44270@lists.php.net to get a copy of this message | ||
apollogies, should of double checked the faq :/
-----Original Message-----
From: Bug Database [mailto:php-dev@lists.php.net]
Sent: 16 January 2001 19:27
To: marcus@xcalibre.co.uk
Subject: PHP 4.0 Bug #8743 Updated: failure to compile when running make
ID: 8743
User Update by: marcus@xcalibre.co.uk
Old-Status: Closed
Status: Open
Bug Type: Compile Failure
Description: failure to compile when running make
gcc -I. -I/home/root/newapache/php-4.0.4pl1/ext/standard -I/home/root/newap
ache/php-4.0.4pl1/main -I/home/root/newapache/php-4.0.4pl1 -I/home/root/newa
pache/apache_1.3.12/src/include -I/home/root/newapache/apache_1.3.12/src/os/
unix -I/home/root/newapache/php-4.0.4pl1/Zend -I/usr/local//include/mysql -I
/usr/local/include -I/home/root/newapache/php-4.0.4pl1/ext/xml/expat/xmltok
-I/home/root/newapache/php-4.0.4pl1/ext/xml/expat/xmlparse -I/home/root/newa
pache/php-4.0.4pl1/TSRM -DXML_BYTE_ORDER=12 -g -O2 -c microtime.c && touch
microtime.lo microtime.c: In function `php_if_getrusage': microtime.c:97:
storage size of
usg' isn't known microtime.c:100: RUSAGE_SELF'
undeclared
(first use in this function) microtime.c:100: (Each undeclared identifier is
reported only once microtime.c:100: for each function it appears in.)
microtime.c:106: `RUSAGE_CHILDREN' undeclared (first use in this function)
make[3]: *** [microtime.lo] Error 1 make[3]: Leaving directory
`/home/root/newapache/php-4.0.4pl1/ext/standard' make[2]: ***
[all-recursive] Error 1 make[2]: Leaving directory
`/home/root/newapache/php-4.0.4pl1/ext/standard' make[1]: ***
[all-recursive] Error 1 make[1]: Leaving directory
`/home/root/newapache/php-4.0.4pl1/ext' make: *** [all-recursive] Error 1
the make log, appologies for not including.
Previous Comments:
---------------------------------------------------------------------------
[2001-01-16 14:02:33] derick@php.net
This is not a PHP bug, your kernel headers are messed up (See
www.php.net/FAQ.php#6.12 )
---------------------------------------------------------------------------
[2001-01-16 13:56:26] derick@php.net
Please post the error message, and the last 20 lines of your configure.log.
---------------------------------------------------------------------------
[2001-01-16 13:56:05] marcus@xcalibre.co.uk
gcc -I. -I/home/root/newapache/php-4.0.4pl1/ext/standard -I/home/root/newap
ache/php-4.0.4pl1/main -I/home/root/newapache/php-4.0.4pl1 -I/home/root/newa
pache/apache_1.3.12/src/include -I/home/root/newapache/apache_1.3.12/src/os/
unix -I/home/root/newapache/php-4.0.4pl1/Zend -I/usr/local//include/mysql -I
/usr/local/include -I/home/root/newapache/php-4.0.4pl1/ext/xml/expat/xmltok
-I/home/root/newapache/php-4.0.4pl1/ext/xml/expat/xmlparse -I/home/root/newa
pache/php-4.0.4pl1/TSRM -DXML_BYTE_ORDER=12 -g -O2 -c microtime.c && touch
microtime.lo microtime.c: In function `php_if_getrusage': microtime.c:97:
storage size of usg' isn't known microtime.c:100: RUSAGE_SELF'
undeclared
(first use in this function) microtime.c:100: (Each undeclared identifier is
reported only once microtime.c:100: for each function it appears in.)
microtime.c:106: `RUSAGE_CHILDREN' undeclared (first use in this function)
make[3]: *** [microtime.lo] Error 1 make[3]: Leaving directory
`/home/root/newapache/php-4.0.4pl1/ext/standard' make[2]: ***
[all-recursive] Error 1 make[2]: Leaving directory
`/home/root/newapache/php-4.0.4pl1/ext/standard' make[1]: ***
[all-recursive] Error 1 make[1]: Leaving directory
`/home/root/newapache/php-4.0.4pl1/ext' make: *** [all-recursive] Error 1
the make log, appologies for not including.
---------------------------------------------------------------------------
[2001-01-16 13:54:04] marcus@xcalibre.co.uk
make
./configure --with-apache=../apache_1.3.12 --enable-versioning --with-mysql
=/usr/local/ --enable-track-vars --enable-ftp --with-mm=../mm-1.1.3
php.ini is default This is the first time compiling php on 2.4.0 but has
been fine before the upgrade. Distro is slackware 7.0.0 GNU Make version
3.77 gcc egcs-2.91.66 Please e-mail me if this is kernel related as these
new secrutiy bug's found in early versions may affect or systems. Thanks
Mark Harburn.
---------------------------------------------------------------------------
Full Bug description available at: http://bugs.php.net/?id=8743