CVS build, PEAR install fails
| From: | Sam Liddicott | Date: | Thu, 18 Jan 2001 15:58:23 +0000 |
| Subject: | CVS build, PEAR install fails | ||
| Groups: | php.dev | ||
| Request: | Send a blank email to php-dev+get-44486@lists.php.net to get a copy of this message | ||
Any idea why? I checked out Zend and TSRM this time...
Sam
# make install
for prog in phpextdist; do \
/usr/share/src/php/build/shtool install -c -m 755
/usr/share/src/php/pear/scripts/$prog /usr/local/bin/$prog; \
done
cp: cannot access /usr/share/src/php/pear/scripts/phpextdist
make[2]: *** [install-programs] Error 2
make[2]: Leaving directory `/usr/share/src/php/pear'
make[1]: *** [install-recursive] Error 1
make[1]: Leaving directory `/usr/share/src/php/pear'
make: *** [install-recursive] Error 1