PHP 4.0 Bug #8996: Netscape Enterprise 4.1 problem during make

From: Date: Tue, 30 Jan 2001 11:29:47 +0000
Subject: PHP 4.0 Bug #8996: Netscape Enterprise 4.1 problem during make
Groups: php.dev 
Request: Send a blank email to php-dev+get-45368@lists.php.net to get a copy of this message
From: prana@agrokor.hr Operating system: Solaris 8 PHP version: 4.0.4pl1 PHP Bug Type: Compile Problem Bug description: Netscape Enterprise 4.1 problem during make ./configure --with-mysql=/usr/local/mysql --with-nsapi=/usr/netscape/server4 --enable-track-vars --enable-libgcc worked ok, but with make I get folowing errors: nsapi.c:50: nsapi.h: No such file or directory nsapi.c:51: base/pblock.h: No such file or directory nsapi.c:52: base/session.h: No such file or directory nsapi.c:53: frame/req.h: No such file or directory nsapi.c:54: frame/protocol.h: No such file or directory nsapi.c:55: base/util.h: No such file or directory nsapi.c:56: frame/log.h: No such file or directory make[3]: *** [nsapi.lo] Error 1 make[2]: *** [all-recursive] Error 1 make[1]: *** [all-recursive] Error 1 make: *** [all-recursive] Error 1 /usr/software/php-4.04pl1/pear/tests/php.ini include_path=.. -- Edit Bug report at: http://bugs.php.net/?id=8996&edit=1

« previous php.dev (#45368) next »