PHP 4.0 Bug #9656: make[3]: *** [sockets.lo] Error 1

From: Date: Fri, 09 Mar 2001 15:26:10 +0000
Subject: PHP 4.0 Bug #9656: make[3]: *** [sockets.lo] Error 1
Groups: php.dev 
Request: Send a blank email to php-dev+get-48410@lists.php.net to get a copy of this message
From: yiannis.neophytou@logosnet.cy.net Operating system: Solaris 8 sparc PHP version: 4.0.4pl1 PHP Bug Type: Compile Failure Bug description: make[3]: *** [sockets.lo] Error 1 Use gcc version 2.95.2 have download the latest CVS Version (sockets.c v 1.32) and still have the same problem while trying to configure wih --enable-sockets. full configure command ./configure --with-apache=../apache_1.3.19 \ --with-oracle --enable-track-vars \ --enable-sockets sockets.c:1762: structure has no member named `msg_controllen' sockets.c:1763: structure has no member named `msg_flags' sockets.c:1795: structure has no member named `msg_control' sockets.c:1796: structure has no member named `msg_controllen' sockets.c:1798: structure has no member named `msg_control' sockets.c:1799: structure has no member named `msg_controllen' sockets.c:1802: structure has no member named `msg_flags' sockets.c:1808: structure has no member named `msg_control' sockets.c:1818: warning: passing arg 3 of `add_assoc_string' makes pointer fromt sockets.c:1820: structure has no member named `msg_controllen' sockets.c:1822: structure has no member named `msg_flags' make[3]: *** [sockets.lo] Error 1 make[3]: Leaving directory `/netdev/apachesrc/php-4.0.4pl1/ext/sockets' make[2]: *** [all-recursive] Error 1 make[2]: Leaving directory `/netdev/apachesrc/php-4.0.4pl1/ext/sockets' make[1]: *** [all-recursive] Error 1 make[1]: Leaving directory `/netdev/apachesrc/php-4.0.4pl1/ext' make: *** [all-recursive] Error 1 -- Edit Bug report at: http://bugs.php.net/?id=9656&edit=1

« previous php.dev (#48410) next »