PHP 4.0 Bug #9531 Updated: make fails at "make ." -> /usr/bin/ld: cannot open -lxmltok

From: Date: Mon, 12 Mar 2001 02:59:17 +0000
Subject: PHP 4.0 Bug #9531 Updated: make fails at "make ." -> /usr/bin/ld: cannot open -lxmltok
Groups: php.dev 
Request: Send a blank email to php-dev+get-48695@lists.php.net to get a copy of this message
ID: 9531 Updated by: sniper Reported By: php@teuchi.de Old-Status: Open Status: Feedback Bug Type: Compile Failure Assigned To: Comments: --with-zlib=/path/to/libz/install/dir --Jani Previous Comments: --------------------------------------------------------------------------- [2001-03-11 17:42:08] php@teuchi.de o well, it would have been to nice ... Making all in . make[1]: Entering directory `/home/family/php-4.0.4pl1' gcc -I. -I/home/family/php-4.0.4pl1/ -I/home/family/php-4.0.4pl1/main -I/home/f amily/php-4.0.4pl1 -I/home/family/php-4.0.4pl1/Zend -I/home/family/libxml2-2.3.3 /include -I/usr/local/mysql/include -I/home/family/php-4.0.4pl1/ext/xml/expat/xm ltok -I/home/family/php-4.0.4pl1/ext/xml/expat/xmlparse -I/home/family/php-4.0.4 pl1/TSRM -DXML_BYTE_ORDER=12 -g -O2 -c stub.c && touch stub.lo /bin/sh /home/family/php-4.0.4pl1/libtool --silent --mode=link gcc -I. -I/home/ family/php-4.0.4pl1/ -I/home/family/php-4.0.4pl1/main -I/home/family/php-4.0.4pl 1 -I/home/family/php-4.0.4pl1/Zend -I/home/family/libxml2-2.3.3/include -I/usr/l ocal/mysql/include -I/home/family/php-4.0.4pl1/ext/xml/expat/xmltok -I/home/fami ly/php-4.0.4pl1/ext/xml/expat/xmlparse -I/home/family/php-4.0.4pl1/TSRM -DXML_B YTE_ORDER=12 -g -O2 -o libphp4.la -rpath /home/family/php-4.0.4pl1/libs -L/hom e/family/libxml2-2.3.3/lib -L/usr/local/mysql/lib -R /home/family/libxml2-2.3.3 /lib -R /usr/local/mysql/lib stub.lo Zend/libZend.la sapi/cgi/libsapi.la main/l ibmain.la regex/libregex.la ext/domxml/libdomxml.la ext/mysql/libmysql.la ext/pc re/libpcre.la ext/posix/libposix.la ext/session/libsession.la ext/standard/libst andard.la ext/xml/libxml.la TSRM/libtsrm.la -ldl -lmysqlclient -lz -lxml -lresol v -lm -ldl -lcrypt -lnsl -lresolv -L/home/family/libxml2-2.3.3/lib -lz /bin/sh /home/family/php-4.0.4pl1/libtool --silent --mode=link gcc -I. -I/home/ family/php-4.0.4pl1/ -I/home/family/php-4.0.4pl1/main -I/home/family/php-4.0.4pl 1 -I/home/family/php-4.0.4pl1/Zend -I/home/family/libxml2-2.3.3/include -I/usr/l ocal/mysql/include -I/home/family/php-4.0.4pl1/ext/xml/expat/xmltok -I/home/fami ly/php-4.0.4pl1/ext/xml/expat/xmlparse -I/home/family/php-4.0.4pl1/TSRM -DXML_B YTE_ORDER=12 -g -O2 -o php -export-dynamic stub.lo libphp4.la /usr/bin/ld: cannot open -lz: No such file or directory collect2: ld returned 1 exit status make[1]: *** [php] Error 1 make[1]: Leaving directory `/home/family/php-4.0.4pl1' make: *** [all-recursive] Error 1 --------------------------------------------------------------------------- [2001-03-11 17:29:02] php@teuchi.de thanks, it seems to work (just compiling...) --------------------------------------------------------------------------- [2001-03-11 17:03:39] sniper@php.net And that configure option is only available in PHP 4.0.5-dev (ie. the CVS snapshot!) --Jani --------------------------------------------------------------------------- [2001-03-11 17:03:02] sniper@php.net Of course it didn't. You didn't read my reply. The configure option is: --with-expat-dir=/path/to/expat --Jani --------------------------------------------------------------------------- [2001-03-11 16:57:34] php@teuchi.de sorry, it didn't help [root@e-smith php-4.0.4pl1]# ./configure --with-dom=/home/family/libxml2-2.3.3 --with-mysql=/usr/local/mysql --with-sablot --with-expat=/usr [root@e-smith php-4.0.4pl1]# make .... /bin/sh /home/family/php-4.0.4pl1/libtool --silent --mode=link gcc -I. -I/home/ family/php-4.0.4pl1/ -I/home/family/php-4.0.4pl1/main -I/home/family/php-4.0.4pl 1 -I/home/family/php-4.0.4pl1/Zend -I/home/family/libxml2-2.3.3/include -I/usr/l ocal/mysql/include -I/usr/local/include -I/home/family/php-4.0.4pl1/ext/xml/expa t/xmltok -I/home/family/php-4.0.4pl1/ext/xml/expat/xmlparse -I/home/family/php-4 .0.4pl1/TSRM -DXML_BYTE_ORDER=12 -g -O2 -o php -export-dynamic stub.lo libphp4.la /usr/bin/ld: cannot open -lxmltok: No such file or directory collect2: ld returned 1 exit status make[1]: *** [php] Error 1 make[1]: Leaving directory `/home/family/php-4.0.4pl1' make: *** [all-recursive] Error 1 --------------------------------------------------------------------------- The remainder of the comments for this report are too long. To view the rest of the comments, please view the bug report online. ATTENTION! Do NOT reply to this email! To reply, use the web interface found at http://bugs.php.net/?id=9531&edit=2

« previous php.dev (#48695) next »