RE: PHP 4.0 Bug #9636 Updated: error message
| From: | Smith, Robert W. | Date: | Wed, 21 Mar 2001 21:56:24 +0000 |
| Subject: | RE: PHP 4.0 Bug #9636 Updated: error message | ||
| Groups: | php.dev | ||
| Request: | Send a blank email to php-dev+get-49693@lists.php.net to get a copy of this message | ||
Before doing that I tried making the directory cgi executable and adding
"#!/usr/local/bin/php" to the scripts. That seemed to do the trick athough
I didn't think this was the GCI version.
Here is the output:
http://www.lib.ecu.edu/st/php/test.php
As far as I can tell, I'm set up for mySQL support
Thanks for your help.
-----Original Message-----
From: Bug Database [mailto:php-dev@lists.php.net]
Sent: Wednesday, March 21, 2001 2:41 PM
To: smithr@mail.ecu.edu
Subject: PHP 4.0 Bug #9636 Updated: error message
ID: 9636
Updated by: sniper
Reported By: smithr@mail.ecu.edu
Status: Feedback
Bug Type: Compile Failure
Assigned To:
Comments:
Get the latest CVS snapshot (from today) add --enable-debug into your
configure line and configure, 'make clean ; make ; make install'
And then generate a GDB backtrace of the crash.
(as it most likely is crashing)
And if it happens with specific script, add the (shortest)
possible script into this bug report that can be used
to reproduce the crash.
--Jani
Previous Comments:
---------------------------------------------------------------------------
[2001-03-08 19:09:37] sniper@php.net
Please try the latest CVS snapshot from http://snaps.php.net/
--Jani
---------------------------------------------------------------------------
[2001-03-08 15:03:06] smithr@mail.ecu.edu
For Netscape Enterprise Server configuration:
After installing all the necessary packages and running
"./configure --with-mysql=/usr/local/mysql --with-nsapi=
/opt/netscape/suitespot --enable-track-vars --enable-libgcc"
When attempting to run "make" I get the following:
# make
Making all in Zend
Making all in Zend
/bin/sh ../libtool --silent --mode=compile c++ -DHAVE_CONFIG_H -I. -I.
-I../main
-D_POSIX_PTHREAD_SEMANTICS -D_POSIX_PTHREAD_SEMANTICS -D_REENTRANT
-DXML_BYTE
_ORDER=21 -I../TSRM -g -O2 -pthreads -c zend_language_scanner_cc.cc
In file included from zend_language_scanner_cc.cc:2571:
zend_operators.h: In function `int is_numeric_string(char *, int, long int
*, do
uble *)':
zend_operators.h:84: implicit declaration of function `int finite(...)'
make[1]: *** [zend_language_scanner_cc.lo] Error 1
make[1]: Leaving directory `/usr/local/php-4.0.4pl1/Zend'
make: *** [all-recursive] Error 1
#
Running gcc-2.95_2
Thanks,
Bob Smith
Computer Systems Administrator
East Carolina University
smithr@mail.ecu.edu
(252) 328-0421
---------------------------------------------------------------------------
ATTENTION! Do NOT reply to this email!
To reply, use the web interface found at http://bugs.php.net/?id=9636&edit=2