PHP 4.0 Bug #10036: dies on make

From: Date: Wed, 28 Mar 2001 15:24:34 +0000
Subject: PHP 4.0 Bug #10036: dies on make
Groups: php.dev 
Request: Send a blank email to php-dev+get-50135@lists.php.net to get a copy of this message
From: jjratelle@yahoo.com Operating system: solaris 8 PHP version: 4.0.4pl1 PHP Bug Type: Compile Failure Bug description: dies on make run make (after ./configure) & receive the following: # make Making all in Zend make[1]: Entering directory `/usr/local/src/php-4.0.4pl1/Zend' /bin/sh ../libtool --silent --mode=link gcc -g -O2 -o libZend_c.la zend_lang uage_scanner.lo zend_ini_scanner.lo ../libtool: ar: not found make[1]: *** [libZend_c.la] Error 1 make[1]: Leaving directory `/usr/local/src/php-4.0.4pl1/Zend' make: *** [all-recursive] Error 1 # make install Making install in Zend make[1]: Entering directory `/usr/local/src/php-4.0.4pl1/Zend' /bin/sh ../libtool --silent --mode=link gcc -g -O2 -o libZend_c.la zend_lang uage_scanner.lo zend_ini_scanner.lo ../libtool: ar: not found make[1]: *** [libZend_c.la] Error 1 make[1]: Leaving directory `/usr/local/src/php-4.0.4pl1/Zend' make: *** [install-recursive] Error 1 I've seen one thread similar to this, with instructions to install all development patches for RH. What should be done for sun? Thanks, JohnR -- Edit Bug report at: http://bugs.php.net/?id=10036&edit=1

« previous php.dev (#50135) next »