PHP 4.0 Bug #10036 Updated: dies on make

From: Date: Thu, 29 Mar 2001 16:30:59 +0000
Subject: PHP 4.0 Bug #10036 Updated: dies on make
Groups: php.dev 
Request: Send a blank email to php-dev+get-50261@lists.php.net to get a copy of this message
ID: 10036 Updated by: sniper Reported By: jjratelle@yahoo.com Old-Status: Open Status: Bogus Bug Type: Compile Failure Assigned To: Comments: No bug in PHP. Either your PATH misses the place where ar is located or you don't have it at all in your system. Ask further support questions on php-install@lists.php.net --Jani Previous Comments: --------------------------------------------------------------------------- [2001-03-28 10:24:34] jjratelle@yahoo.com run make (after ./configure) & receive the following: # make Making all in Zend make[1]: Entering directory `/usr/local/src/php-4.0.4pl1/Zend' /bin/sh ../libtool --silent --mode=link gcc -g -O2 -o libZend_c.la zend_lang uage_scanner.lo zend_ini_scanner.lo ../libtool: ar: not found make[1]: *** [libZend_c.la] Error 1 make[1]: Leaving directory `/usr/local/src/php-4.0.4pl1/Zend' make: *** [all-recursive] Error 1 # make install Making install in Zend make[1]: Entering directory `/usr/local/src/php-4.0.4pl1/Zend' /bin/sh ../libtool --silent --mode=link gcc -g -O2 -o libZend_c.la zend_lang uage_scanner.lo zend_ini_scanner.lo ../libtool: ar: not found make[1]: *** [libZend_c.la] Error 1 make[1]: Leaving directory `/usr/local/src/php-4.0.4pl1/Zend' make: *** [install-recursive] Error 1 I've seen one thread similar to this, with instructions to install all development patches for RH. What should be done for sun? Thanks, JohnR --------------------------------------------------------------------------- ATTENTION! Do NOT reply to this email! To reply, use the web interface found at http://bugs.php.net/?id=10036&edit=2

« previous php.dev (#50261) next »