Bug #10587: Make fails

From: Date: Tue, 01 May 2001 19:16:23 +0000
Subject: Bug #10587: Make fails
Groups: php.dev 
Request: Send a blank email to php-dev+get-53227@lists.php.net to get a copy of this message
From: oli@out.to Operating system: MacOS X 10.0.1 PHP version: 4.0.5 PHP Bug Type: Compile Failure Bug description: Make fails After folloing the installation instructions for MacOS X on a HFS volume, as shown on the Stepwise site www.stepwise.com/Articles/Workbench/2001-03-24.01.html I get the following output during make: ---------------------------------------- internal_functions.c:32: `#include' expects "FILENAME" or < FILENAME> make[2]: *** [internal_functions.lo] Error 1 make[1]: *** [all-recursive] Error 1 make: *** [all-recursive] Error 1 ---------------------------------------- Then it stops. -- Edit Bug report at: http://bugs.php.net/?id=10587&edit=1

« previous php.dev (#53227) next »