Bug #10587 Updated: Make fails

From: Date: Sat, 05 May 2001 18:30:49 +0000
Subject: Bug #10587 Updated: Make fails
Groups: php.dev 
Request: Send a blank email to php-dev+get-54020@lists.php.net to get a copy of this message
ID: 10587 Updated by: sas Reported By: oli@out.to Old-Status: Open Status: Closed Bug Type: Compile Failure PHP Version: 4.0.5 Assigned To: Comments: This has been fixed in March, but was unfortunately not committed to the 4.0.5 release branch. You can fix this in your copy by copying two files into the build subdirectory and rerunning configure: http://viewcvs.php.net/viewcvs.cgi/~checkout~/php4/build/print_include.awk?rev=1.2&content-type=text/plain http://viewcvs.php.net/viewcvs.cgi/~checkout~/php4/build/genif.sh?rev=1.2&content-type=text/plain Previous Comments: --------------------------------------------------------------------------- [2001-05-01 15:16:23] oli@out.to After folloing the installation instructions for MacOS X on a HFS volume, as shown on the Stepwise site www.stepwise.com/Articles/Workbench/2001-03-24.01.html I get the following output during make: ---------------------------------------- internal_functions.c:32: `#include' expects "FILENAME" or < FILENAME> make[2]: *** [internal_functions.lo] Error 1 make[1]: *** [all-recursive] Error 1 make: *** [all-recursive] Error 1 ---------------------------------------- Then it stops. --------------------------------------------------------------------------- ATTENTION! Do NOT reply to this email! To reply, use the web interface found at http://bugs.php.net/?id=10587&edit=2

« previous php.dev (#54020) next »