Bug #10827: error when type make

From: Date: Sat, 12 May 2001 09:51:02 +0000
Subject: Bug #10827: error when type make
Groups: php.dev 
Request: Send a blank email to php-dev+get-54991@lists.php.net to get a copy of this message
From: turk@turkeynet.net Operating system: Slackware 7.1 PHP version: 4.0.5 PHP Bug Type: Compile Failure Bug description: error when type make microtime.lo microtime.c: In function `php_if_getrusage': microtime.c:99: storage size of `usg' isn't known microtime.c:102: `RUSAGE_SELF' undeclared (first use in this function) microtime.c:102: (Each undeclared identifier is reported only once microtime.c:102: for each function it appears in.) microtime.c:108: `RUSAGE_CHILDREN' undeclared (first use in this function) make[3]: *** [microtime.lo] Error 1 make[3]: Leaving directory `/usr/src/php-4.0.5/ext/standard' make[2]: *** [all-recursive] Error 1 make[2]: Leaving directory `/usr/src/php-4.0.5/ext/standard' make[1]: *** [all-recursive] Error 1 make[1]: Leaving directory `/usr/src/php-4.0.5/ext' make: *** [all-recursive] Error 1 -- Edit Bug report at: http://bugs.php.net/?id=10827&edit=1

« previous php.dev (#54991) next »