Bug #10827 Updated: error when type make
| From: | sniper@php.net | Date: | Mon, 14 May 2001 12:32:18 +0000 |
| Subject: | Bug #10827 Updated: error when type make | ||
| Groups: | php.dev | ||
| Request: | Send a blank email to php-dev+get-55144@lists.php.net to get a copy of this message | ||
ID: 10827
Updated by: sniper
Reported By: turk@turkeynet.net
Old-Status: Open
Status: Bogus
Bug Type: Compile Failure
Operating system:
PHP Version: 4.0.5
Assigned To:
Comments:
http://www.php.net/FAQ.php#6.12
Previous Comments:
---------------------------------------------------------------------------
[2001-05-12 05:51:02] turk@turkeynet.net
microtime.lo
microtime.c: In function `php_if_getrusage':
microtime.c:99: storage size of `usg' isn't known
microtime.c:102: `RUSAGE_SELF' undeclared (first use in this function)
microtime.c:102: (Each undeclared identifier is reported only once
microtime.c:102: for each function it appears in.)
microtime.c:108: `RUSAGE_CHILDREN' undeclared (first use in this function)
make[3]: *** [microtime.lo] Error 1
make[3]: Leaving directory `/usr/src/php-4.0.5/ext/standard'
make[2]: *** [all-recursive] Error 1
make[2]: Leaving directory `/usr/src/php-4.0.5/ext/standard'
make[1]: *** [all-recursive] Error 1
make[1]: Leaving directory `/usr/src/php-4.0.5/ext'
make: *** [all-recursive] Error 1
---------------------------------------------------------------------------
ATTENTION! Do NOT reply to this email!
To reply, use the web interface found at http://bugs.php.net/?id=10827&edit=2