build failure with current CVS

From: Date: Mon, 14 May 2001 14:25:22 +0000
Subject: build failure with current CVS
Groups: php.dev 
Request: Send a blank email to php-dev+get-55168@lists.php.net to get a copy of this message
D:\compile\php\current>uname -a WindowsNT zvahlav 0 5 x86 basic_functions.c D:\compile\php\current\ext\standard\basic_functions.c(1787) : error C2065: 'executor_globals' : undeclared identifier D:\compile\php\current\ext\standard\basic_functions.c(1787) : error C2223: left of '->function_table' must point to struct/union (...) D:\compile\php\current\ext\standard\basic_functions.c(1787) : error C2198: 'call_user_function' : too few actual parameters D:\compile\php\current\ext\standard\basic_functions.c(1801) : error C2223: left of '->function_table' must point to struct/union (...) D:\compile\php\current\ext\standard\basic_functions.c(1802) : error C2198: 'call_user_function' : too few actual parameters (...) Error executing xicl6.exe. php4apache.dll - 5 error(s), 44 warning(s) cynic@mail.cz ------------- And the eyes of them both were opened and they saw that their files were world readable and writable, so they chmoded 600 their files. - Book of Installation chapt 3 sec 7

« previous php.dev (#55168) next »