Bug #10959: include' expects "FILENAME" or <FILENAME>

From: Date: Fri, 18 May 2001 17:13:43 +0000
Subject: Bug #10959: include' expects "FILENAME" or <FILENAME>
Groups: php.dev 
Request: Send a blank email to php-dev+get-55811@lists.php.net to get a copy of this message
From: mjack@mac.com Operating system: Mac OS X PHP version: 4.0.5 PHP Bug Type: Compile Failure Bug description: include' expects "FILENAME" or &lt;FILENAME&gt; After running ./configure --with-xml --with-apxs=/usr/sbin/apxs --disable-pear --enable-track-vars --with-mysql=/usr/local, I get: internal_functions.c:32: `#include' expects "FILENAME" or <FILENAME> make[2]: *** [internal_functions.lo] Error 1 make[1]: *** [all-recursive] Error 1 make: *** [all-recursive] Error 1 in the "Making all in main" step. Michael -- Edit Bug report at: http://bugs.php.net/?id=10959&edit=1

« previous php.dev (#55811) next »