Bug #10959 Updated: include' expects "FILENAME" or <FILENAME>

From: Date: Fri, 18 May 2001 18:05:38 +0000
Subject: Bug #10959 Updated: include' expects "FILENAME" or <FILENAME>
Groups: php.dev 
Request: Send a blank email to php-dev+get-55814@lists.php.net to get a copy of this message
ID: 10959 User Update by: mjack@mac.com Status: Open Bug Type: Compile Failure Operating system: Mac OS X PHP Version: 4.0.5 Description: include' expects "FILENAME" or <FILENAME> Sounds as if this bug is related to # 9716 Michael Previous Comments: --------------------------------------------------------------------------- [2001-05-18 13:13:43] mjack@mac.com After running ./configure --with-xml --with-apxs=/usr/sbin/apxs --disable-pear --enable-track-vars --with-mysql=/usr/local, I get: internal_functions.c:32: `#include' expects "FILENAME" or <FILENAME> make[2]: *** [internal_functions.lo] Error 1 make[1]: *** [all-recursive] Error 1 make: *** [all-recursive] Error 1 in the "Making all in main" step. Michael --------------------------------------------------------------------------- Full Bug description available at: http://bugs.php.net/?id=10959

« previous php.dev (#55814) next »