Bug #10959 Updated: include' expects "FILENAME" or <FILENAME>
| From: | sniper@php.net | Date: | Sat, 19 May 2001 16:26:34 +0000 |
| Subject: | Bug #10959 Updated: include' expects "FILENAME" or <FILENAME> | ||
| Groups: | php.dev | ||
| Request: | Send a blank email to php-dev+get-55899@lists.php.net to get a copy of this message | ||
ID: 10959
Updated by: sniper
Reported By: mjack@mac.com
Old-Status: Open
Status: Closed
Bug Type: Compile Failure
Operating system:
PHP Version: 4.0.5
Assigned To:
Comments:
yes, and this is fixed in CVS. Try out http://www.php.net/~andi/php-4.0.6RC1.tar.gz
Reopen if you have same problem with that release candidate.
--Jani
Previous Comments:
---------------------------------------------------------------------------
[2001-05-18 14:05:38] mjack@mac.com
Sounds as if this bug is related to # 9716
Michael
---------------------------------------------------------------------------
[2001-05-18 13:13:43] mjack@mac.com
After running ./configure --with-xml --with-apxs=/usr/sbin/apxs --disable-pear --enable-track-vars
--with-mysql=/usr/local, I get:
internal_functions.c:32: `#include' expects "FILENAME" or <FILENAME>
make[2]: *** [internal_functions.lo] Error 1
make[1]: *** [all-recursive] Error 1
make: *** [all-recursive] Error 1
in the "Making all in main" step.
Michael
---------------------------------------------------------------------------
ATTENTION! Do NOT reply to this email!
To reply, use the web interface found at http://bugs.php.net/?id=10959&edit=2