Bug #11758: --with-apxs2 compile option failed with Apache 2.0.16

From: Date: Wed, 27 Jun 2001 22:07:43 +0000
Subject: Bug #11758: --with-apxs2 compile option failed with Apache 2.0.16
Groups: php.dev 
Request: Send a blank email to php-dev+get-58246@lists.php.net to get a copy of this message
From: vlast@eetc.com Operating system: RedHat 7.1 PHP version: 4.0.6 PHP Bug Type: Compile Problem Bug description: --with-apxs2 compile option failed with Apache 2.0.16 Making all in sapi make[1]: Entering directory `/usr/local/src/php-4.0.6/sapi' Making all in apache2filter make[2]: Entering directory `/usr/local/src/php-4.0.6/sapi/apache2filter' make[3]: Entering directory `/usr/local/src/php-4.0.6/sapi/apache2filter' /bin/sh /usr/local/src/php-4.0.6/libtool --silent --mode=compile gcc -I. -I/usr/local/src/php-4.0.6/sapi/apache2filter -I/usr/local/src/php-4.0.6/main -I/usr/local/src/php-4.0.6 -I/usr/local/apache2/include -I/usr/local/src/php-4.0.6/Zend -I/usr/local/src/php-4.0.6/ext/mysql/libmysql -I/usr/local/src/php-4.0.6/ext/xml/expat/xmltok -I/usr/local/src/php-4.0.6/ext/xml/expat/xmlparse -I/usr/local/src/php-4.0.6/TSRM -D_REENTRANT -DSUPPORT_UTF8 -DXML_BYTE_ORDER=12 -I../TSRM -DTHREAD=1 -g -O2 -pthread -c sapi_apache2.c sapi_apache2.c: In function `php_input_filter': sapi_apache2.c:248: too many arguments to function `ap_get_brigade' sapi_apache2.c: In function `php_register_hook': sapi_apache2.c:443: warning: passing arg 2 of `ap_register_input_filter' from incompatible pointer type make[3]: *** [sapi_apache2.lo] Error 1 make[3]: Leaving directory `/usr/local/src/php-4.0.6/sapi/apache2filter' make[2]: *** [all-recursive] Error 1 make[2]: Leaving directory `/usr/local/src/php-4.0.6/sapi/apache2filter' make[1]: *** [all-recursive] Error 1 make[1]: Leaving directory `/usr/local/src/php-4.0.6/sapi' make: *** [all-recursive] Error 1 -- Edit Bug report at: http://bugs.php.net/?id=11758&edit=1

« previous php.dev (#58246) next »