Bug #11775 Updated: Typo in cpdf.c
| From: | derick@php.net | Date: | Thu, 28 Jun 2001 21:56:50 +0000 |
| Subject: | Bug #11775 Updated: Typo in cpdf.c | ||
| Groups: | php.dev | ||
| Request: | Send a blank email to php-dev+get-58382@lists.php.net to get a copy of this message | ||
ID: 11775
Updated by: derick
Reported By: graeme@inetix.com.au
Old-Status: Open
Status: Closed
Bug Type: Compile Failure
Operating system:
PHP Version: 4.0.6
Assigned To:
Comments:
Fixed in CVS. Thanks for reporting.
Derick
Previous Comments:
---------------------------------------------------------------------------
[2001-06-28 08:21:11] graeme@inetix.com.au
Compiling with cpdf causes an error
make[3]: Entering directory `/usr/local/src/build/php4/ext/cpdf'
gcc -I. -I/usr/local/src/build/php4/ext/cpdf -I/usr/local/src/build/php4/main
-I/usr/local/src/build/php4 -I/usr/local/src/build/php4/Zend -I/usr/local/include
-I/usr/include/mysql -I/usr/local/src/build/php4/ext/xml/expat -I/usr/local/src/build/php4/TSRM -g
-O2 -c cpdf.c && touch cpdf.lo
cpdf.c:36: zend/zend_list.h: No such file or directory
make[3]: *** [cpdf.lo] Error 1
make[3]: Leaving directory `/usr/local/src/build/php4/ext/cpdf'
make[2]: *** [all-recursive] Error 1
make[2]: Leaving directory `/usr/local/src/build/php4/ext/cpdf'
make[1]: *** [all-recursive] Error 1
make[1]: Leaving directory `/usr/local/src/build/php4/ext'
make: *** [all-recursive] Error 1
This is due to line 36 of cpdf.c:
#include "zend/zend_list.h"
Should be:
#include "Zend/zend_list.h"
---------------------------------------------------------------------------
ATTENTION! Do NOT reply to this email!
To reply, use the web interface found at http://bugs.php.net/?id=11775&edit=2