Re: Bug #12159 Updated: Make fails, both 4.0.5 and 4.0.6 during microtime...

From: Date: Sat, 14 Jul 2001 05:53:45 +0000
Subject: Re: Bug #12159 Updated: Make fails, both 4.0.5 and 4.0.6 during microtime...
Groups: php.dev 
Request: Send a blank email to php-dev+get-60017@lists.php.net to get a copy of this message
I checked the FAQ, and ran the test from test.c in the faq; Lots of output from gcc, but no errors ! Same symptom, so the diagnosis may be correct; however the test does not show the issue as indicated... Is there an alternate test I can try ? The faq was spot on with the compile errors... Mike
From: Bug Database <php-dev@lists.php.net> To: gandolf_the_grey@hotmail.com Subject: Bug #12159 Updated: Make fails, both 4.0.5 and 4.0.6 during microtime... Date: 14 Jul 2001 05:43:59 -0000 Received: from [208.247.106.187] by hotmail.com (3.2) with ESMTP id MHotMailBD1927CE006E40043149D0F76ABB0F6B0; Fri, 13 Jul 2001 22:46:54 -0700 Received: (qmail 2956 invoked by uid 99); 14 Jul 2001 05:43:59 -0000 From root@php2.chek.com Fri, 13 Jul 2001 22:46:59 -0700 Message-ID: <20010714054359.2955.qmail@php2.chek.com> X-PHP-Bug: 12159 In-Reply-To: <bug-12159@bugs.php.net> ID: 12159 Updated by: rasmus Reported By: gandolf_the_grey@hotmail.com Old Status: Open Status: Closed Bug Type: *Compile Issues Operating System: Linux kernel 2.4.4 PHP Version: 4.0.6 New Comment: This is a FAQ. You upgraded to the Linux 2.4 kernel without upgrading your kernel headers and libc appropriately. See http://php.net/FAQ.php#6.12 Previous Comments: ------------------------------------------------------------------------ [2001-07-14 01:41:40] gandolf_the_grey@hotmail.com Make fails during compilation: both in 4.0.5 and .6 microtime.c: In function php_if_getrusage: microtime.c:99: storage size of 'usg' isn't known microtime.c:103: `RUSAGE_SELF' undeclared (first use in ... microtime.c:108: `RUSAGE_CHILDREN' undeclared (first... make[3]: *** [microtime.lo] Error 1 make[3]: Leaving directory `/usr/src/php-4.0.5/ext/standard make[2]: *** [all-recursive] Error 1 make[2]: Leaving directory `/usr/src/php-4.0.5/ext/standard make[1]: *** [all-recursive] Error 1 make[1]: Leaving directory `/usr/src/php-4.0.5/ext make: *** [all-recursive] Error 1 Config directive : --with-mysql --with-apxs=/LIBRARY/WebServers/apache/sbin/apxs --prefix=/LIBRARY/WebServers/php --exec-prefix=/LIBARY/WebServers/php Mod_so.c exists and appears in httpd -l . /usr/local/lib/mysql exists in /etc/ld.config. Make fails at that point. Michael Grey ------------------------------------------------------------------------ ATTENTION! Do NOT reply to this email! To reply, use the web interface found at http://bugs.php.net/?id=12159&edit=2
_________________________________________________________________ Get your FREE download of MSN Explorer at http://explorer.msn.com

« previous php.dev (#60017) next »