PHP 4.0 Bug Summary Report

From: Date: Sat, 28 Jul 2001 16:01:02 +0000
Subject: PHP 4.0 Bug Summary Report
Groups: php.dev 
Request: Send a blank email to php-dev+get-61326@lists.php.net to get a copy of this message
PHP 4.0 Bug Database summary - http://bugs.php.net Num Status Summary (1415 total including feature requests) ===============================================[*Configuration Issues]======== 10598 Open Windows Protocol & ini file placement 11751 Open PEAR cant be used with safe mode 12015 Feedback One of the library files needed to run this application cannot be found. 12174 Open doc_root open_basedir directoves symlink not resolved when copy(create?) a file ===============================================[*Database Functions]========== 12384 Open Can't connect to Ingres II ===============================================[*Directory/Filesystem functions] 12004 Open problem with fopen over ftp and a related fgets ===============================================[*Encryption and hash functions] 10822 Open CRYPT_SALT_LENGTH == 2 even when CRYPT_MD5 available 11363 Open Apache fails to start 11892 Open crypt gone without a trace ===============================================[*General Issues]============== 9041 Analyzed Extra #! at top of web output. 9096 Duplicate #! line in a script is outputed in script 10062 Duplicate CGI version displays '#!/usr/local/bin/php' line 11708 Analyzed PHP safe mode troubles 11975 Open mix of hebrew & english 12179 Open browscap parsing error ===============================================[*Graphics related]============ 10166 Open read_exif_data loads whole image into memory 11283 Open read_exif_data only gets first "Comments" record 11784 Open read_exif_data fails on big thumbnails ===============================================[*Languages/Translation]======= 9392 Open htmlspecial chars & htmlentities do not handle double byte charactersets 9524 Open htmlentities do not translate corretly 11232 Open compiling extention Fribidi 11244 Open Reversed '[]{}<>' in hebrev, hebrevc ===============================================[*Regular Expressions]========= 6680 Open regexps (ereg*) ignores locale settings 7231 Open REG_ECOLLATE bug? 9919 Open problem with umlauts, the modifier "i" and \b 10111 Open e modifier alters string extraction in preg_replace 10154 Open Function ereg array results 10314 Open split() function is'nt stable 11253 Open eregi slight mistak? 11461 Open \. after \- does not work ===============================================[*URL Functions]=============== 10327 Open "urldecode" decodes url-encoded cyrillic strings incorrectly. ===============================================[*Web Server problem]========== 7641 Open cgi binary with "enable-discard-path" fails with empty doc_root value 8449 Open register_globals=on and track_vars=on produce strange results for arrays 8506 Duplicate CGI PHP doesn't erase the #!/path/to/php 10043 Open action handler not working 10277 Open $PHP_AUTH_USER and $PHP_AUTH_PWD ===============================================[Apache related]=============== 8865 Open App launching with hotkeys delayed 8866 Open Frozen applications with apache module running 9088 Open php404sp1 broke MIPS Apache - webserver cannot start 9280 Open HTTP/1.1 Expect: header not honoured 9287 Open Stronghold only start one process when using DSO PHP4 with OCI8 support 9422 Open Apache hangs when Win goes to standby 9827 Open Floating point exception when starting apache 10056 Open Unable to load libphp4.so into Apache 1.3.19 10060 Open startup error msg format 10075 Open Exta path information beyond the PHP script won't work with CGI 10099 Open Segfault in Apache 1.3.19 + PHP4.0.x DSO 10233 Duplicate Big file uploading problem form HTML FORM 11056 Duplicate file upload (size > 1MB) takes too much time 11109 Open Floating Point Exception in php_minit_crypt 11137 Open apache doesn't start with php, but does RESTART with php 11191 Open apache dumps core with oracle-enabled libphp4.so 11225 Open Some Applications hang when PHP is running 11471 Duplicate #!/usr/local/bin/php on top of all PHP pages 11647 Open Installation Failure 11690 Duplicate apxs does not support -S 11716 Open Segmentation fault(coredump) in Apache(DSO-enabled) startup 11802 Open Page Not found error after setting (max_execution_time to 10800) 11864 Open php_value in .htaccess-files makes ordinary .html-files be parsed through php. 11914 Feedback Segmentation fault on Apache 1.3.20/1.3.19 11964 Open libphp4.so fails during load 12001 Open Apache 1.3.6 + RedHat 6 12063 Open "make install" fails on cp lib/libphp4.so 12067 Open Cannot load libphp4.so into server 12068 Open Maybe a memory leak or something. 12107 Open Child processes are SegFaulting 12202 Open Apache processes keep growing until all memory is used up 12209 Open apxs not creating libphp4.so during 'make install' 12210 Open DirectoryMatch/php_value/.htaccess 12303 Feedback apache segfaults when using imp 12322 Feedback php does not load as a dso 12390 Open Apache returns php pages with zero sized reply 12399 Open Linking against OS X port of libdl causes problems 12425 Open apache core dumps when started with a php.ini in /usr/local/lib ===============================================[Arrays related]=============== 7045 Analyzed Shuffle() does behave correctly 7762 Open array_multisort() doesn't always correctly reassign references between values 8032 Open array_splice made array keys bad 10120 Analyzed implode(), if empty elements exist 10264 Open strange associative array behaviour 10449 Open shuffle() function crashes PHP 10658 Open array_diff does not work with classes 10891 Open array_unique does not work properly anymore 11074 Open array_splice used to insert associative array forgets first key 11338 Open arraydiff returns a vector with "empty" values for found values 11372 Open array_multisort does not maintain key association 11389 Analyzed array_walk causes Apache to crash 11893 Open array_intersect doesn't handle multidimensional arrays correctly 12201 Open Order in array function ===============================================[BC math related]============== 10116 Open bcpow treats second argument as integer ===============================================[Bzip2 Related]================ 12233 Open Result of Bzdecompress function ===============================================[CCVS related]================= 10447 Assigned ccvs_*() functions segfault when given invalid session ID ===============================================[Class/Object related]========= 7765 Duplicate not OO until automatic class destructor is added 9054 Open problems in call_user_method 9068 Assigned Bugs in OO which are leaking memory... 9090 Duplicate call_user_method() duplicates object 9447 Open call_user_method functions do not pass references 9587 Analyzed obj->method()->method2() doesn't work!! 10088 Open Object linking 10096 Open get_object_vars does not work as expected 10293 Open object reference vs. true object function passing problem 11073 Open parent::Function() does not work if parent class is included 11543 Open Calling an object's method changes the variable to a reference to this object. 11748 Open setting reference to $this in constructor. 11768 Open references still have bugs 11800 Open call_user_method() bug (it won't change properties) 12277 Open in PHP4 constructors still seem to behave like in PHP3 12365 Open Problems with classes and links to objects 12398 Open Problem with associative arrays, used within classes 12430 Open is_subclass_of ===============================================[ClibPDF related]============== 10393 Open CPDFlib support not compile as module 11242 Open Apache explodes if I leave out cpdf_page_init() ===============================================[COM related]================== 12126 Open the com example 1 does not work 12341 Feedback Don't is appears the object 12403 Open VARIANT.c : error C2065 'CP_SYMBOL' : undeclared identifier ===============================================[Compile Failure]============== 6854 Duplicate zend_execute compile failure -> for all ZEND_API inline's in the .h 7280 Duplicate global iniline not supported in SGI Compiler 7474 Analyzed ext/standard/scanf.c reports strtol/strtoul "undefined reference" 7731 Open compilation with deprecated abi (no -n32) 8844 Open -rpath is not used correctly, causing configure failure 8871 Open missing required flags for Compaq compiler 9285 Open Compile fails on scanf.h 9335 Open configure fails to add -lc-client 9469 Assigned HAVE_REALPATH not being checked 9501 Open variable sapi_module defined multiple places 9901 Open When running the make it fails 9946 Open asctime_r has wrong number of arguments 10185 Open compile fails when using --with-oci8 10342 Analyzed TSRM.DSP containing LF instead of CR/LF 10776 Open Externally set LDFLAGS not exported by configure 10805 Open Compile error on zend_operators.c 10806 Open make fails on Tru64. 11043 Suspended apache2 build fails: undefined symbol: tsrm_error 11113 Open Problem with compile on NT 11138 Open Cannot build php with IMAP support 11313 Open XML module not liniked 11606 Open Compile problem in Zend: zend_language_scanner_cc.cc 11691 Open Compiling fails with Apache 1.3.20 and 1.3.9 11707 Critical FILE.lo isn't a libtool type if built php as a cgi 11761 Open LC_CTYPE undeclared 11776 Duplicate filestat.c:php_if_diskfreespace': storage size of buf' isn't known 11790 Open Error compiling PHP 11840 Open Can't find libjpeg after upgrade to 4.0.6 11846 Feedback AL EJECUTAR MAKE MARCA ERROR 11853 Open unknown option -l-l 11873 Feedback Apache make error with module php4 and ldap 11879 error al ejecuta make 11946 Open compile fails on Solaris 8 11967 Open scan_set_error_return MUST NOT be "inline" 12007 Suspended Conflict in ncurses and cpdf? 12124 Feedback Cannot compile... 12132 Open Doesn't compile 12145 the same as 10636, but on IRIX 12147 Open Very similar to 10185, but with Oracle 8.0.3 12195 Open TSRM 12207 Open shared library created not loadable 12279 Open error 2 (bu21) 12282 Open PHP ./configure --with-snmp - Error during make 12294 Open Compile fails with error almost immediatley. 12302 Open timezone,struct statfs,linking 12355 Open PHP-CVS doesn't compile --with-ncurses 12397 Open Error in /usr/src/php-4.0.6/ext/standard/filestat.c:157 12445 Open ./configure suxx ===============================================[Compile Warning]============== 12034 Open A type-error and a coding-error. 12070 Open "Error: invalid number of arguments (at least 1 expected)" during compilation ===============================================[cURL related]================= 10673 Open CURL/PHP causes lengthy Apache Keepalive 11856 Open CURLOPT_HEADER 11901 Open CURLOPT_HEADERFUNCTION result wrong header 11908 Open Post not binary safe 12045 Open no content=cURL crashes sometimes 12149 Open PHP 4.0.6 upgrade seems to break cURL https 12205 Open https not working 12211 Open cURL (OpenSSL) https:// calls do not function 12216 Open 4.0.6 + curl 7.8 Do not properly support https 12433 Open Curl Crush, CURLOPT_WRITEHEADER ===============================================[Cybercash related]============ 8255 Open CyberCash support not correctly installed ===============================================[Date/time related]============ 8828 Duplicate mktime using mday<=0 8857 Open microtime() doesn't work after setlocale(LC_NUMERIC,"pl") 9007 Duplicate strtotime cannot cope correctly with time zones 9640 Assigned strtotime() cannot properly handle some ISO 8601-compliant strings 9878 gmmktime is 1 hour off during standard time 10550 Assigned mktime() returns -1 for certain valid dates 10686 Open Bug in "mktime()" on values out of bounds 10694 Assigned mktime leap year bug 11696 Open php_mktime problems 12161 Feedback The date() function ===============================================[dBase related]================ 3777 Open Dbase_create fails to recognize array of arrays 5993 Analyzed numeric fields with field len > 10 are chopped 6519 Open dbase_replace_record writes (null) in .dbf 6788 Open dbase read functions lead to random segfault 6852 Open Misc. bugs 7374 Open Boolean Fields always return 0 with dbase_get_record 7620 Open dbase_get_record_with_names crashes php 8229 Open core dump on dbase_replace_record 8677 Open dbase module built with phpize doesn't work. 9121 Open the dbase functions either segfault or generate the following debug information 9739 Open Reading logical values doesn't work: fix attached 10984 Open dbase_replace_record() can't work 11431 Open dbase_replace_record 11928 Open dbase_replace_record writes (null) in .dbf ===============================================[DBM/DBA related]============== 8574 Open Berkeley DB (dba) support 8819 Open dbm functions do not work correctly 9222 Open dbmreplace() and dbmdelete() don't run 9283 Open Serialized data gets corrupted in DBM 9934 Open faulty dbmfetch() 9994 Open dbmfetch 10380 Open dba_*open with mode 'c' problem 10798 Open dba_open (mode "c") problem 11700 Open db2 driver initialization failed 11732 Analyzed db3 driver initialization failed 12020 Open dbm insert and replace functions inserting incorrect values. 12418 Open ndbm - driver initialization ===============================================[Directory function related]=== 11062 Open Sharing Violation Error Message ===============================================[Documentation problem]======== 3783 Analyzed versioning + mysql impossible ! 4294 Analyzed return in script called from php.ini stops engine 6180 Analyzed missing operators in docu 7888 Assigned decrement syntax should be -- instead of - 8252 Assigned $PATH_INFO instead of $PHP_SELF in CGI mode 8969 Analyzed Gettext does not work 9356 Assigned settype thinks 0.2 and (1.2 - 1) have different values 9710 Open ImageTTFText bounding box coordinates incorrect in manual 9914 Analyzed session_id loss with redirection via header() method 9938 Suspended Incorrect documentation in Spanish Session handler fuctions 9983 Open Operator Precedence Clarification/Additions 9986 Open Insufficient Windows installation instructions 10374 Open Depreciated features or not 10398 Open configuration chapter still has the old php 3 error_reporting values 10445 Duplicate character Lenght of filenames 10528 Open I have been unable to find any documentation on the SAPI interface. 10532 Open Documentation Errata 10636 Open php_oci8.c -- undefined constants 10842 Open FAQ section 8.1 should mention <input name="array[key]"> syntax 10862 Open Filenames too long in downloadable manual 11013 Assigned The Windows CHM format help file is missing a section. 11017 Open Documentation for pspell_new_config() is wrong 11220 Analyzed special chars insertion into oracle / NLS_LANG 11297 Open swf_shapecurveto() description missing an element 11491 Analyzed When using ob_start("ob_gzhandler") transient SID gets broken 11598 Open Configuration section doesn't distinguish between admin and user values. 11618 Analyzed session and form data 11619 Assigned Socket function examples scripts aren't working with latest CVS 11703 Open Failed opening prepend.php3 11719 Open Clarification of $foo = new Class and $foo = &new Class 11738 Open Unresolved symbols in Apche DSO 11789 Open Apache can't start: Sybase-ct & LC_ALL 11803 Analyzed call to undefined function not caught by set_error_handler 11833 Open Unsufficient docs 11937 Assigned Bug in array handling 11940 Open ill side effect of open_basedir 12011 Assigned Safe_mode poor documentation 12060 Open $userfile['name'][0] not set ! 12093 persistent db conns 12114 Open XML documentation improvement? 12131 Open misworded gmp_random documentation(?) 12151 Open http://www.php.net/FAQ.php#6.11 discrepancy 12212 Open iSilo PDB documentation seems to be broken 12347 Analyzed Misspelled text 12367 Analyzed array_diff don't work with array of array (it did with 4.0.4) 12375 Feedback FAQ section on multiple select box 12388 Open PostgreSQL configuration requirements missing in PostgreSQL function summary 12434 Open confusing.... ===============================================[DOM XML related]============== 8922 Open @xmldoc(...) doesn't quite suppress errors 9683 Open XML DOM memory leak w/ libxml 2.3.3 9740 Open wrong xml node content 9893 Open Wrong args in xpath_ functions makes apache crash 10172 Open get_class() doesn't return lowercase for DomX objects 10667 Open xmltree function cause memory leak 10767 Open CDATA sections not type'd or content'd 10936 Open DOMXML crash with CDATA 10994 Open DOMXML CDATA Node Bug 11164 Open output conversion failed due to conv error 11189 Open No DTD-Validation 11304 Feedback memory leak 11353 Open Memory leak in php_domxml.c, domxml_dumpmem 11354 Open docs allocated by xmlParseFile need to be freed 11698 Analyzed Memory leak 11903 Open xpath_eval does not work with default namespace. 12002 Feedback SIGSEGV with DOMXML (double free()?) 12079 Open SEGFAULT when compiled with APXS and QTDOM ===============================================[Dynamic loading]============== 2220 Assigned dynamic module memory leaks cause SIGSEGV under DEBUG mode 7031 Open symbol ifx_checkAPI: referenced symbol not found 8343 Open Undefined symbols: _strtol when PHP4 compiled as DSO --with-mysql 8592 Open couldn't make shared extension module using phpize. 8981 Analyzed Apache fails to load PHP module 9822 Open -R ld option not being pass thru libtool 10488 Open --with-regex=apache fails to resolve php_regcomp when loading Apache 11668 Open Oracle and MS-SQL cannot co-exist 11912 Open undefined symbol 12186 Open Dynamic Library support not available ===============================================[Feature/Change Request]======= 586 Open configure does not support apache shadow tree 745 Analyzed <input type=image> and array variables 979 Analyzed [PEAR] Openmarket Transact support 1027 Open fprintf() please 1029 Open printf (& sprintf) dosn't handle exponential format for floats correctly 1189 Open SetCookie and Header error reporting improvement 1432 Feedback fgets() fails on certain sockets 1504 Open New function to set the http status 1515 Analyzed improving php standalone mode 1571 Open support for mknod(): pipe creation 1658 Open Enhance Sybase-ct to fetch limited rows 1713 Open copy() function allows copy files from anywhere in filesystem 1830 Open Unpack() gives fatal error if not enough data. 2107 Open Exec as TTY 2328 Open I would like animated gif support within php. 2341 Open expression evaluation - improvement 2352 Analyzed Create subgroup of database functions 2483 Open set_file_buffer return value 2541 Open dl(string name) should not require the file extension for the module name 2807 Open LOB descriptors with Fetch/Result and FetchInto 2931 Analyzed A request to add greater CSV file support 3066 Open 3074 Analyzed allow: foreach ($array as $key => &$val) in zend (byref) 3101 Open safe mode also with GID 3149 Analyzed Unable to pass "-" or "+" as parameter when running as command-line 3219 Suspended GDTTF error 3275 Analyzed [PEAR] ICQ support 3276 Open Add PGP support 3285 Open Cannot feed command stdin and get output, etc. 3293 Open You can't put multiple prepend/append files 3367 Open PHP code callback during file upload 3427 Open Too many \n in show_source 3457 Open Function requests 3462 Analyzed foreach behavior on a non-array 3514 Open Private and Protected data in classes 3551 Open base_convert() 3697 Analyzed open_basedir prevents creating files with fopen 3708 Open Have configure detect missing pieces of modules and generate warnings 3799 Suspended default_charset brings small incompatibility 3830 Analyzed Function to timeout/break off a function 3859 Open Null values in ODBC Databases 3928 Open shorthand notation for filling associative arrays, please 3942 Open New switch - "XML well-formedness" (comply to XHTML/1.0 spec). 4089 Open No bug, only a suggestion 4223 Analyzed PHP calls MySQL with apache user instead of connected user 4346 Open Suggestion for error trap in imagecreatefromjpeg 4426 Open php when run w/ binfmt_misc does not work w/ apache 4548 Open Sysloging and Error Reporting 4551 Open Session Slow to save in Frameset 4587 Open Would like exit and die to return an int 4612 Suspended Too much of $this 4669 Open Need a session_end() ?? 4769 Open Params passed by reference in extension functions 4822 Duplicate Uploading in safe mode 4856 Open have get_browser() not relying on external browscap.ini 4875 Open array_merge() is unable to merge arrays with numeric keys 4884 Open array merging(concat) with + 5007 Analyzed enable no-resolve mode for here docs 5008 Open readfile(), flag to read file into a string 5040 Open Support for persistent HTTP/1.0 connections 5050 Analyzed $php_errormsg not changed on errors inside functions 5127 Open can´t use anything but a simple string with new (and var) 5142 Open Allow properties and methods of a class to be declared as public or private 5153 Open fopen("http://...") has no timeout 5169 Open Missing recursive behavior 5174 Open OCIBindByName doesn't need quoting in strings 5226 Analyzed arrayfields reorganized when using array_pop 5255 Open gzuncompress is deflate 5278 Open ob_* enhanced to use HTTP headers 5288 Open bash style case for switch() 5301 Open cosmetic change in phpinfo() output 5311 Analyzed Checkdnsrr 5343 Open a way of implementing class methods 5408 Open foreach() should silently ignore non-array's passed to it 5422 Open option to disable safe_mode restrictions in open_basedir directories 5435 Open Request to update eval() or create new function. 5476 Open crypt() function is not supported in windows build 5499 Open MySQL/Module warning in CGI compile 5521 Open brushed and styled for GD 5560 Open php.ini-optizimized install instructions 5563 Open Cache 5575 Open open_basedir to ~ 5601 Analyzed @function() should not turn of error reporting for critical errors 5639 Open unable to locate imap client library? 5682 Open Allow connection string in place of DSN for ODBC connections 5748 Open Suggestion for Installation 5804 Open parser error if any spaces follow indentifier in with here doc syntax 5865 Open fopen with ssl support 5883 Feedback --enable-trans-sid modification request 5889 Analyzed pack() does not take arrays 5907 Open output cgi's php is bugged 5908 Open POST file uploading and HTTP_POST_VARS 5917 Analyzed return in OR statement alowed(like $a OR die("plop"); 5954 Open Informix can't reliably figure if a text result column is NULL 5960 Open Output buffering and headers 5975 Open enhancement of strip_tags needed 6019 Analyzed Error with equal operator when comparing certain values 6082 Open User defined error handler should be avare if function was prefixed with @ 6090 Open ftell() returns -1 (not false) if an error occurs. 6107 Analyzed increments are magic, decrements not 6118 Open Can not supress runtime warnings on foreach 6136 Open Exception Handling 6160 Open pg_notice( ); 6193 Analyzed new object makes a shallow copy 6222 Open ora_fetch_array? 6238 Analyzed var_dump() param for deactivating reference following 6268 Open ternary op return only by value 6305 Analyzed when string contains "at", wrong time returned 6310 Open Connect to ACCESS DB without a DSN 6339 Analyzed invalid Sybase-link resource - problem with last opened link 6343 Open enable pass by reference to be optional 6360 Open Enable use of exported DLL functions 6368 Open Bitwise NOT does not work 6371 Feedback unicode feature request... 6380 Open Session handlers should be allowed in objects 6399 Open checkdate should be able to validate a time as well as a date (timestamp) 6406 Open request: fork() function 6418 Open Multiple class extends ordering error 6427 Open func_get_arg() does not support references 6446 Open Session Array Variable Append 6503 Open no support for multiple resultset query? 6512 Analyzed sort() Does not sort stings as expected 6513 Open get_browser() and $HTTP_USER_AGENT 6563 Open OCIPLogon should check the connection 6574 Open SMTP functions via IMAP c-client library 6584 Open SNMP "get-next" function is missing 6602 Open Failure to warn of duplicate class methods 6642 Open Userspace exploit crashes web-serving machine 6701 Open Use of http_proxy for fopen("http:// ... 6714 Open email validation function 6746 Open Support for Sybase bcp and large result sets 6768 Open list() construct reference assignment 6771 Open Import LIB files needed in Win32 distribution 6775 Open Allow <?=$value?> as shortcut under XML with short_tags off 6787 Analyzed read_exif_data returns data even without real exif date 6853 Open is_link malfunction? 6859 Open Need for a conversion table like HTMLENTITIES but with ASCII values. 6875 Duplicate upload_tmp_dir in php.ini doesn't work in safe_mode 6893 Open feature request - makelinks() function 6906 Open setting locale affects PHP code parser! 6911 Open Problem with array_merge(_recursive) 6927 Suspended 6932 Open Filesize / File_exists and include_path 6982 Open disable_functions option don't works in Apache config 6989 Open imap_sort interprets headers 6993 Open uninstalling is a pain in the ass 7006 Open preg_replace ( string pattern, array replacement, string subject ); 7028 Analyzed xml=shared and wddx do not work together 7095 Open Unwanted content-type header 7121 Open fopen() doesn't owerwrite files opened via a FTP connection 7132 Open fsockopen doesn't report dns lookup failure 7213 Open Read a file into a variable with one call 7217 Open Security Problem with "include_dir" configuration 7220 Open Error Report on Function Arguments 7243 Duplicate upload_tmp_dir does not work in safe_mode 7276 Open CVSup/rsync/easier patch access desired 7354 Open Feature Request: sort on single element arrays 7398 Open Stored procedure error return values not passed through 7418 Open Mac WWW upload error FIX 7440 Open Print function calling stack 7463 Open File Upload Feature Request 7480 Open next(), end(), prev(), reset() etc. don't return references 7507 Open Better ODBC error reporting/fetching 7535 Open Entities missing in get_html_translation_table ( HTML_ENTITIES ); 7541 Open please consider also support HPUX shl_* 7553 Open RFC: Uplevel Block structure 7559 Open zend_hash_get_current_key_ex returning persistent strings 7568 Open 64-bit integers, 32-bit unsigned and 64-bit unsigned 7578 Open next() and current() do not return referenceing arrays 7629 Assigned Mail() fails when the email message has a "\n" 7741 Open .cgi does not adhere to quasi-RFC 7766 Open not OO until automatic class destructor is added 7775 Open Wishlist - get IP address on sockets 7782 Open Cannot use PATH_INFO fully with php isapi 7805 Open N/A 7808 Open variable value triggerd by function 7829 Open hex2bin()? 7869 Open parse_str produces no trapable value 7899 Open Class selfdestruct 7923 Open htmlentities doesn't work for ISO 8859-2 7930 Open List() constructor reference assignment 7944 Open Missing shared build options 7974 Open N/A 8005 Open --with-pgp 8006 Open raw_mail() function 8007 Open Getting Process ID from apache-child/cgi-thing 8009 Open mysql_fetch_array and same Column Name 8017 Open PHP ignores "If-Modified-Since" headers 8058 Open 8070 Open wish list: oci8.max_persist in php.ini 8074 Open IPTC parse 8075 Open Make Function/Method return value a "direct" object 8087 Open fsockopen declaration 8100 Assigned extract(), extra feature 8108 Analyzed implement trans-sid as output handler 8109 Open xslt_outout_begintransform() doesn't nest 8128 Open more descriptive parse error reports 8187 Open Partial FTP Downloads 8194 Open Need for a "const" qualifier. 8197 Open lack of socket() functions 8214 Open Request for Signal Handling functions 8217 Open long2ip gives 127.255.255.255 result instead of correct value 8218 Open str_replace() with count of replacements 8282 Open Is there a function for this? 8290 Analyzed allow func_*_arg?() functions as function parameters inside a function 8295 Open absolute path in extension= directive in php.ini not recognized 8301 Open Mail doesn't support -f 8325 Open numeric strings used as keys are converted to longs 8328 Open ucwords and ucfirst misbehaving with quotes 8373 Duplicate foreach by reference 8377 Critical File uploads with POST methods takes full Server processing capacity and memory 8395 Open register_shutdown_function() error 8397 Open Multi-results sets are not suppported 8427 Open Unwanted references 8428 Open continue doesn't pass thru a switch statement 8447 Duplicate foreach does not take "list" for value 8515 Open Add function to read from stdin 8576 Open implement C style __FUNCTION__ constant 8577 Open i would kill for the ability to undefine() 8595 Open More effective parsing of list() (+other) 8599 Open a kind Exception handling 8640 Open enumeration type 8644 Open Include Signal catching for parse errors 8681 Open Function arguments in 'global' 8685 Open Here-Syntax problem 8687 Open fopen : prepend 'p' option request 8717 Open feature request: ftp_rawlist 8728 Open Patch: usleep() working on win32 platforms 8779 Open @foreach() does not denote error-message 8796 Analyzed "$foo->bar->baz" ambiguity in double quoted strings 8809 Open Cookieless session with Header redirects 8817 Suspended $foo->getbar()->getfoobar()->method() 8827 Open PHP_AUTH_PW stores password when using External Authentication 8849 Open open_basedir doesn't apply to function 'copy' 8855 Open session_start should return also FALSE 8860 Open variable array not working 8863 Open function to get constant values by variable name 8879 Open iPlanet: setting doc_root etc. for virtual servers 8882 Open Additional argument in funtion file($a, $b) 8897 Open Significant portions of the InterBase API have no PHP representation. 8914 Open How about proxy settings for remote file ops? 8948 Open readline_completion_function enhance 8960 Open Request for a more flexible Metaphone function 8963 Open using shared PHP libraries in safe_mode 8974 Open Blank lines in includes cause session errors 8978 Analyzed Add a 'readonly' possibility to the session module 8982 Open socket support not compiled 9022 Open Selectable option for PHP_AUTH_PW 9025 Open ldap compare functions 9035 Open Need a PHP_AUTH_REALM built-in variable 9084 Analyzed url-activation for simple URLs 9095 Open colon/semicolon delimitd extension_dir ? 9099 Feedback please include one browscap.ini 9108 Open ini_get_all() 9117 Assigned output_handler = ob_gzhandler 9136 Analyzed simple script with infinite function calls causes seg fault 9155 Open set_error_handler() to accepts object/method tuple 9170 Open session_start() session_resume() session_create() 9173 Open getline 9187 Open unable to use socket 9195 Open Default class function arguments 9200 Open strtolower handle arrays in addition to strings 9211 Open URL and PHP Info/Options functions NEEDED 9212 Open fpassthru ignoring output buffering 9250 Open Nested Functions are BAD, they make for inefficient debugging 9262 Analyzed Inconsistency in the implementation of here-docs 9266 Analyzed Unable to load 14 of php's extensions 9308 Open Allow Unix to use Win32 only mail options 9309 Analyzed update ereg function to return booleans instead of 0/1 9331 Suspended No operator overloading available 9374 Open add an optional use_include_path to file_exists() 9397 Open odbc_setoption() cannot accept string value (patch included) 9417 Open zend_eval_string() doesn't work like eval() :( 9423 Open Please create a function that returns name of currently executing function 9426 Open Form variables encoding problem 9440 Open Bug in php.ini parser 9441 Open New feature for foreach control structure 9515 Open PHP misbehaves when run as a script with SERVER_NAME environment variable def'd 9516 Open No trivial way to bypass safe mode when running as a shell 9517 Open No settings for OCI8 module regarding persistent connections 9558 Open array hanling 9572 Open mysql_connect() with timeout 9578 Open mysql_select_db() returning currently seected database 9593 Duplicate disable_functions does not work as an Apache Directive 9611 Open organization of function reference section of manual 9622 Open Support for mime_header_encode 9654 Open is_type consolidation 9676 Open Feature request for set_time_limit 9743 Open can exec() or system() return the pid ? 9750 Open Informix Fetch Array 9751 Open WANTED: Informix RESET 9752 Open Auto Table Generation (ifx_htmltbl_result) 9765 Open syntax request 9768 Open Support for negative_equals_false configuration variable 9777 Open Function/Class prototypes? 9808 Open crypt function not supported 9823 Open srand() -- seed should default to (double)microtime()*1000000 9824 Open lack of bidirectional popen() 9875 Open bicubic jpg resize 9877 Open Need SYSV Message Queue Support 9900 Open sem_remove or similar missing 9902 Open Converting to/from mysql timestamp 9928 Open Feature rqst: timeout in readline 9962 Open php.ini-dist is setup for unix. 9969 Open Feature request: persistent FTP connections 9976 Open No DTD support in DOM functions 9978 Open Encoding for XML version declaration 9991 Open Registry-Access denied? 10032 Open mysql_connect not making a new connection each time it is called 10039 Open uninstallation 10049 Open Slashes passed thru a file upload 10055 Open strtotime() doesn't work on MSSQL standard dates 10102 Analyzed Parse error 10104 Open Feedback 10141 Analyzed $HTTP_USER_AGENT 'breaks' in a URL-included file 10160 Open Unix timestamp doesnt go over Tuesday 19 January 2038 05:11 10190 Open \t$var = <<<EOI\n\tblah\tEOI; 10203 Open foreach weakness 10217 Open Feature 10238 Analyzed erealloc() function error 10262 Open fgets/fputs timeout 10310 Open feature request 10344 Open in memory container for each machine user 10349 Open Warning: getrusage() is not supported 10350 Open OCIResult doesn't return time for an Oracle Date field 10351 Open Parsing problem with nested ? : structures 10352 Open Request for stri_replace 10359 Open opendir enhancement 10429 Open Improving substr() 10502 Open parsing for HTTP_POST_VARS drops duplicates 10517 Open suggestion for ease of use 10524 Open register_shutdown_function request 10527 Open Declare variables as constants 10546 Open extract() to work with objects 10549 Open Performance problem with Openlink ODBC drivers 10596 Suspended Suggestions for new functions 10629 Open SMTP: mail() the fifth parameter 10657 Open settype() with larger than 32bit values 10677 Open Session lifetimes beyond browse on per session basis 10743 Open class functions & PHP core functions inconsistently clash ;) 10863 Open serialize/unserialize doesn't handle references 10885 Open Add result type to mssql_fetch_array 10916 Open (Feature Request) OS-independent path parsing 10937 Open Interface to execl() library call 10940 Open ((true) && (true)) to return bool 11004 Open Allow ini_set() of magic_quotes_sybase to have effect 11011 Open hex2bin? 11060 Open 64 bit integer support 11063 Suspended $var = function_returning_array(args)[0]; doesn't work 11067 Open dumpmem() does not ident, or even make new lines when called 11070 Open '@' does not turn off error checking in foreach() 11077 Open two new array functions 11100 Open session_garbage_collector function 11142 Open '::' for object variables. Static code 11259 Open please add "move" file in filesystem functions 11262 Open Sybvase-ct: suppress "command aborted" messages 11282 Open dBase3 support needed (MIVA uses it) 11332 Open signal handling 11352 Open HTTP server internal redirect 11379 Open Local/Global variable scope inside functions 11391 Open No uninstaller 11393 Open __FUNCTION__ 11399 Open By Reference 11409 Open Debug function: get caller function stack 11457 Open limit for str_replace() 11507 Open Function within a function namespace 11537 Open We need an operator for prepending a string to a string. Something like =. 11549 Open open_basedir/include_path security improvement 11558 Open Sybase-CT functions not found. 11567 Analyzed True Dynamic Binding and Public/Private 11587 Open SSL'd fsockopen would be nice 11592 Analyzed need for an a SIGALRM based timeout mecanism 11596 Open More ways of passing by refrence 11597 Open 11601 Open E_NOTICE produces a Warning 11615 Open change/modify parent syntax 11626 Open additional oci function for quoting 11651 Open Need something like a __LINE__ constant to show the line in *main* file. 11753 Open Need way to load sent XML 11756 Analyzed Private, Protected variables in classes 11798 Open "svar_dump()" wanted 11812 Suspended mail function 11830 Open domxml_new_child should manage also xml docs 11836 Suspended Require nor Include works inner a class file 11844 Feedback It would be nice to have tags in PHP just like JSP tags. 11878 Open __DATE__ /__TIME__ constants 11894 Open want posix_getgrent() function 11939 Open get HTML title 11944 Open Scripting language features 11958 Open session_register_method() needed 11982 Open session_expires() 11987 Open General scripting features/build 12012 Open dec2bin and bin2dec 12023 Open mysql_result moves the data pointer forward one row. 12028 Open array_sum changed 12035 Analyzed Function dir with match 12066 Open Enable transparent Session IDs for a whole Domain not only relative Links 12074 Open Enhance sybase_ct with sybasel_unbuffered_query(), 12163 Open More use of PHP Scripting Engine 12192 Open case insensitivity for in_array 12199 Open Bad return value from include_once() 12204 Open Datbase can not spoken on. 12214 Open Additional param to ereg/eregi/ereg_replace/eregi_replace 12220 Open help 12225 Open [XML] support for other encoding in utf8_decode , utf8_encode 12256 Open Error tracking:pass the line number of the function call instead of fun.defin 12284 Open negative limits in explode() 12312 Open array_mt_rand() ? 12316 Open Have to increase memory_limit to be able to upload big files 12321 Open ftruncate poorly named, suggest alias 12364 Open Uninstallation via Configuration screen 12370 Open Feature suggestion 12379 Open conversion from html entities to normal text 12385 Open getmxrr returns an invalid false message when... 12405 Open The result of create_function should be accepable to the parser 12428 Open I want 'echoln' 12441 Open print line function? 12442 Open optional linenumbers in show_source 12444 Open require_once doesn't support relative paths completely 12447 Open Function to encode strings for XML ===============================================[filePro related]============== 12102 Open iloveu ===============================================[Filesystem function related]== 7597 Open similar to #5375. when filtering double slashes from file upload 7960 Open fopen or fclose troubles with 'php://stdin' 8579 Open text files do not have \r\n translation from \n 8780 Open difference in fwrite with cgi/apachemodule 8785 Open using Informix with PHP CGI 9128 Open Memory Leak or Memory Problem. 9203 Open flock doesn't work properly on Windows 2000 9208 Open rename() not using current working directory 9697 Open filename ends with £ 9787 Open redirecting php-cgi stderr does not affect php://stderr 9846 Open fopen() fails and gives Error 0 on NoContent URLs 9847 Open fopen() fails with Error 0 on Forbidden URLs 10229 Open buffer error in fread 10236 Open ftruncate problem 10439 Open relative chdir from root doesn´t work 10482 Open if the filesize if more than 2GB, filesystem functions do not seem to recognize 10564 Open feof bug isn't fixed in windows versions. 10566 Analyzed don't work properly fopen 10700 Open unlink() doesn't like win/unc names 10956 Open move_uploaded_file() 10996 Analyzed fopen of url results in invlaid file handle 11115 Open copy() returns "false" even if file was successfully copied 11322 Open Security hole in multiuser environment 11563 Open FileFunction macro in filestat.c appears to be missing a check (fix included) 11640 Open realpath(): wrong results with $PHP_SELF 11828 Feedback Useless flock() 11855 Open fgets returns truncated data 11984 Open filetype function not working for non-existant files 12097 Open fseek bug 12098 Open fseek bug 12127 Open Function fgetcsv() lost some letters 12337 Open Function fscanf does not correctly handle "\t" in format string 12439 Open fopen and URL on the same server ===============================================[FTP related]================== 8874 Feedback ftp_nlist and rawlist not working 8999 Feedback difference ftp_fget() cgi and module 10835 Open File Upload 11000 Feedback ftp_connect(...) produces ftpbuf 0 "error" 11025 Duplicate ftp_connect() does not work with IP address 11842 Open ftp_rawlist and ftp_nlist dont show list in directory that has spaces in it 12344 Open Handling of multiples responses in ftp client is buggy 12436 Open ftp_fput causes memory access violation ===============================================[GD related]=================== 7663 Feedback Initialization problem at fontFetch() 10548 Open function ImageTTFText always get wrong chinese words from TTF ... 11150 Open Win2k & ImageTTFBox & ImageTTFText 11813 Feedback ImageGammaCorrect no longer works 11976 Open image_copy_resized does not work properly 11994 Feedback imagettfbbox returns null 12111 Feedback gdImageCreateFromPng dos not work 12248 Feedback Page hangs as soon as I have added the _gd extension in php.ini 12254 Feedback PHP/gd compilation problems - gd.c:95: conflicting types for `gdIOCtx' 12349 Feedback Broken PNG image 12376 Feedback PHP isn't loading the extension modules... 12402 Open Including GD support shuts down PWS 12449 Analyzed I've tried inserting my php.ini file in five locations and it won't load it ===============================================[GetImageSize related]========= 12200 Feedback getimagesize() JPG Bug ===============================================[Gettext related]============== 8555 Open gettext crashing PHP 10058 Open Gettext doesn't react when I change the language 10135 Open Problem(?) with environment variables when running as module 10333 Open anything is OK, it really seems a buggy thing 10603 Open Problems changing the language. ===============================================[HTTP related]================= 6499 Analyzed $upload_type[] has wrong size with empty multiple-file uploads 8440 Suspended fopen on a url returns "success" as an error 9460 Open File upload problem when the form control name is an array element 10033 Feedback Function file does not work with remote files 10307 Open PHP refusing to get temporary file name from an HTTP PUT request. 10383 Open Receiving an HTTP PUT, rather than sending one 10800 Open File uploads take ~70 times longer than downloading files on Apache/PHP. 10998 Analyzed include http file 11058 Open php_network_getaddresses: getaddrinfo failed 11112 Open socket_set_blocking breaks in w32, you can send data but cannot read response 11116 Open File upload sometimes work, sometimes fails 11204 Critical readfile/file fail if HTTP header is not returned 11323 Open thttpd+php4 upload bug with post-method 11578 Open http header order not respected and messages not transmitted 12272 Feedback Handling of file submissions from Opera incorrect 12283 Open File uploads: some filetypes work, some don't 12414 Feedback HTTP POST on lynx not supported 12426 Open Critical PHP bug while processing big POST data (>10K) ===============================================[Hyperwave related]============ 10353 Open Intermittent segfault on failed connection 10913 Open hw_who() returns incorrect data & prints extraneous string (patch incl.) 10944 Open hw_info() prints garbage for server string 11125 Open hw_insertanchors() segfaults with non-hex Position attributes 11246 Open hw_incollections() misbehaving ===============================================[ICONV related]================ 12443 Open --with-iconv works, iconv_get_encoding() is present, but iconv() isn't ===============================================[IIS related]================== 6763 Open Outlook web access doens't work when PHP Isapi filter is installed 7237 Open PHP Isapi Filter fails after some consecutive uses 7449 Open CGI Error when a php script isn't under c:\inetpub\wwwroot 7908 Open Out of process application '/LM/W3SVC/4/Root' terminated unexpectedly 8060 Open Access Violations at XXXXXXXX 8094 Open ISS stops serving ASP and PHP files 8434 Duplicate PHP has encountered an Access Violation at 01292466 8571 Open CGI application misbehaved 8649 Open session.auto_start can't write to files in isapi mode 8650 Open Warning: Server Error when using local smtp 8744 Open call to header() causes CGI error 8813 Open PHP locks MetaBase for extended periods. 8830 Open Internal Server error at random intervals 9119 Open JVM execution problem 9206 Open unable to load file to the disk 9258 Open Mail function hangs SMTP server 9428 Open CGI error when executing php script in a virtual directory 9535 Open Server Application Error 9579 Open POST method not performing action handler (ISAPI) 9688 Open FTP_PUT / FOPEN 9802 Open header() doen't work together with setcookie() 9852 Open Header redirect and db connection cause "CGI misbehaved" 9981 Open http 500 Internal Server Error 10050 Open ISAPI module crashing when different sites on the same server 10240 Open passthru / exec etc have problems with input & output of executed programs 10480 Open ISAPI module conflicts with asp.dll 10486 Open IIS causes the Internal server error 10664 Feedback php4.0.5 ISAPI dll gives "procedure not found" 10725 Open Cannot load ISAPI file php4isapi.dll 10839 Open Crashes (critical on W2k) 10883 Open conflict between PHP ISAPI and asp.dll 10930 Open Can't connect to mysql after running some code that crashes IIS 5 10973 Open Setcookie does't work 11002 Open Corrupt Output 11151 Open PHP ISAPI cause ASP to malfunction under special circumstances 11300 Open MSCOMCTL.OCX is missing on clean Windows machine. 11661 Open Memory Access Violation 11783 Open CGI Error with non local Virtual directory 11788 Open CGI-Error and 502 Bad Gateway 12184 Open PHP has encountered an Access Violation at 0129E68A 12191 Assigned Certificate Environment Variables missing with ISAPI 12215 Open 500 on all server-side script 12264 Open PATH_INFO and PATH_TRANSLATED not being correctly set 12359 Open Error 12366 Open PHP-ISAPI Module hang 12406 Open Can't connect to MySQL through IIS 12410 Open PHP MySQL commands don't work with MS Proxy Client 12421 Open The w3swc service is gaving error cannot load isapidll 12438 Open PHP creates problem with ASP pages. ===============================================[IMAP related]================= 7670 Assigned PHP crashes when accessing IMAP mailbox 10356 Open imap_utf7_encode cann't encode Chinese correctly 11153 Open imap_check() returns wrong date 11561 Open Inconsistent behavior between imap_getmailboxes and imap_getsubscribed 11603 Analyzed imap_sort function fails on huge mailboxes 11870 Open unable to load dynamic library 11871 Open imap_search fails to search using FROM 11934 Open failure to configure --with-imap-ssl 12125 Feedback imap-ssl configure test fails (fixed!) See 11934 12241 Open imap.so: undefined symbol: mxdriver in Unknown on line 0 12346 Open 4.0.6 imap refuses to authenticate to VMS IMAP4rev1 Server PMDF V6.0-24.1 ===============================================[Informix related]============= 6798 Assigned IFX queries fail, SQLCODE -480 (dup. descriptors) 7149 Open Warning: ifx_connect : E [SQLSTATE=IX 000 SQLCODE=-25560] 7152 Open Can't close a connexion to a database 7173 Open Invalid IFX link resource 8267 Open Warning: ifx_pconnect : E [SQLSTATE=IX 000 SQLCODE=-439] 8715 Open ifx_get_blob ifx_fetch_row and NULLS 8767 Open user name prepended to table names in query 8784 Feedback using Informix with PHP CGI 9270 Open Informix Remote Host Connection 9464 Open ifx.ec compile warning (ts_allocate_id) 9604 Open Unable to compile CVS Source with Informix support (executor_globals undeclared 9832 Open httpd memory problem with informix 10415 Open ext/informix/ifx.ec:4354: `executor_globals' undeclared 10803 Open ifx_fetch_rows() 12440 Feedback kaola404 ===============================================[InterBase related]============ 6976 Assigned ibase_query can't execute SQL statements that can't be prepared 7014 Assigned ibase_query (rest of php_interbase.dll?) 8142 Open on exit() from method, interbase makes a mess with transaction ids 8517 Open BLOB functions don't work with IB6 8604 Open ibase_blob_import() return pure binary string, unusable in INSERT INTO sql 8713 Open Compatible with InterBase ver.<6.0 8797 Open There is no way to use REC_VERSION transaction parameter 9990 Open php forces the apache to wait for ever 10326 Open Error while inserting cyrillic symbols into database 10610 Open Read Only behaviour! 10816 Open Crash when calling ibase_trans with invalid link ID 10872 Open Cannot load php_Interbase.dll extension... 10948 Open Apache can't load with php_interbase.dll 11154 Open Invalid Result on IB Decimal/Float datatype called from stored procedure 11176 Open Bad results when retrieving IB decimal/float data type from stored procedures 11208 Open ibase_blob_open crash apache 1.3.19/20 11468 Open Cannot execute stored procedures 11530 Open PATCH: InterBase/Firebird Decimal/Numeric type returns incorrect value type 11631 Open php_interbase.dll problem 11644 Open Interbase dll causes PWS ISAPI to die 11924 Open problem with ibase_execute called through call_user_func_array() 11953 Open wrong conversion from data type NUMERIC with decimal places into string 12003 Open failed to locate host machine 12006 Feedback inaccorate result when connent to Interbase 6 12038 problem with closing database handles 12052 Open BUG #12006 12330 Open ibase_query not support class 12338 Open Cannot open two connection simultaneously 12383 Open $105.04 becomes $105.4!!! ===============================================[iPlanet related]============== 8996 Open Netscape Enterprise 4.1 problem during make 9114 Open X509 Certificate Environment variables 9116 Open PHP will stop returing anything in NES 4.1 SP1 9169 Open Default html file is not showing anymore 9602 Open Unable to compile with NSAPI support, implicit declaration of finite function 9851 Open getenv() functions do not return variables. 10012 Duplicate installing after compiling --with-nsapi on iPlanet 4.1SP6 fails 10263 Assigned Use of istdiostream w/o HAVE_CLASS_ISTDIOSTREAM protection 10379 Open ns-httpd crashes on php content. 10581 Open signal 6 when starting server 10817 Open Web server won't start after configuration 10821 Open Web server won't start after php make install 10871 Open pclose() failed. (2: unknown early startup error) 11039 Open Netscape Server 3.6 / Solaris 8 problems... 11174 Open Web server won't start after php make install 11181 Open PHP_AUTH_USER and PHP_AUTH_PW are not set 11256 Open OleMainThreadWndName not responding 11442 Open Random "Warnig: Failed opening" on any php file 11713 Open IPlanet and sessions cause script to terminate prematurely 12258 Open ns-http won't start: Dies in thread-init code 12431 Open IPLANET JVM abort ===============================================[Java related]================= 6617 Open JVM starts only on 3 requests per httpd 8459 Open PHP's crash JVM after a few requests 8691 Open Periodically recieve "Unable to create Java Virtual Machine" when running test 9162 Open Java support corrupts Hashtables 9507 Analyzed Java Classes and session_register 9608 Open JVM instantly crashes with ext/java 9658 Open saps Servlet reproducible crash. 9659 Open sapi servlet crashes when exceptions thrown in java code 9660 Open sapi servlet excessive memory usage. 10146 Open PHP Servlet is not thread-safe 10271 Open PHP servlet causes segmentation violation in native code 11925 Open Php under with sapi servlet crashes 11927 Open php sapi servlet doesn't compile 11930 Open better sapi/servlet support ===============================================[LDAP related]================= 8714 Open Adding LDAP entries drops credentials if update is referred 8929 Open ldap modify and add operations send trailing garbage to iplanet in dn's 9793 Analyzed ldap_mod_add with bad params cause Segfault 11845 Open ldap_mod_add/ldap_mod_del duplicating LDAP calls sporadically 12223 Open ldap rebind procedure implementation 12231 Open about ldap_get_values_len ===============================================[Mail related]================= 3248 Analyzed mail function putting wrong timezone info in message header? 6537 Assigned mail() does not seem to handle SMTP multi-line responses 7068 Assigned fails when 'to:' argument has the form "Name <name@somewhere.xxx>" 7458 Open FATAL: emalloc(): Unable to allocate -11773805 bytes 8734 Duplicate Unable to send large emails, causes a GPF - small email work fine. 8747 Duplicate Cant send a file with more than 2607 octets 8909 Assigned PHP generates the Date: header line with a bad timezone 9489 Open The mail() function doesn't return the success or error 9498 Assigned quoted_printable_decode - Incorrect function result 9965 Open email command gives 'Warning: Failed to Receive ' 10136 Assigned Function mail() does not work properly 10182 Assigned problem with the "To" field 10213 Duplicate mail() changes the sign of the time zone 10769 Open sendmail_port does not work 11021 Duplicate apache crash when mail with linked files over 2 ko 11165 Assigned limit in lenght of mail 11247 Assigned mail() on Win32 messes with Reply-To: or Errors-To: fields, 11348 Assigned cannot send email attachments 11349 Assigned Function not working as documented 11616 Assigned Cc: & Bcc: not being picked up from header 11797 Assigned CC and BCC don't work in mail() function 11822 Feedback Warning: mail() ist not supported in this PHP build in ... 11950 Feedback not sending e-mail at all 12024 Open mail() is not supported in this PHP build 12134 Open imap problems under php406 12142 Open mail problem with apache aliases on win2000 and Linux (tested on both) 12178 Open ext/standard/mail.c insecurity 12285 Open Problem in header parameter 12335 Feedback mail() function returns false but the email was sent. ===============================================[Math related]================= 8961 Analyzed Omited Math Function 10133 Open Some values returned by gmp_strval are null-terminated 10715 Open -0 Returns true as an integer 12155 modulus % 12435 Open Incorrect results from logical AND ===============================================[mcrypt related]=============== 10187 Assigned Warning: mcrypt module initialization failed 10281 Duplicate Same as 10187 11642 Assigned mcrypt_generic() leaks memory ===============================================[mnoGoSearch related]========== 12369 Open mnoGoSearch extension ===============================================[mSQL related]================= 5986 Open Combination of msql() and msql_connect() causes lost connections. 6827 Assigned End of generated html is truncated on large page 7301 Duplicate Error in msql_result: reproducible 11133 Open msql_create_db( ) not work? ===============================================[MSSQL related]================ 8398 Feedback Php can not get any message from RAISEERROR 8627 Open mssql_query and stored procedures 8783 Duplicate mssql_query() function returns empty result after succesfull UPDATE or DELETE 9071 Open Wide Charater problems 9500 Duplicate mssql_query returns false for INSERT & UPDATE queries 9667 Open Can't get result of a stored procedure 9757 Open Php.exe Process doesnt kill itself 9791 Open Stored Procedures 10011 Open Get results from a store procedure 10755 Open PHP work very slow with Ms Sql, 99% processor load when I process SQL instr. 11593 Open varchar(8000) field in MSSQL returns only 4096 chars 11621 Open PHP crashes while using MSSQL functions 11735 Open mssql_pconnect fails 11868 Open Improper character encoding 11923 Open when you access char(2000),i only get 255 bytes data, why ? 11972 Feedback library does not loaded 12095 mssql_pconnect access violations 12250 Open Segfault when using FreeTDS connect 12319 Feedback Apache shutdowns with a distant MSSQL 6.5 if connection failed 12348 Open Call to undefined function: mssql_next_result() ===============================================[MySQL related]================ 7244 Open Problem with LOAD DATA LOCAL INFILE 7634 Open mysql_pconnect() + lock tables can hang server 7951 Open Can't connect to MySQL from PHP script under OrionServer (Socket problem) 8634 Critical problem with multiple mysql links mysql_connect mysql_close 9245 Duplicate mysql_connect, mysql_pconnect do not report errors if there are any. 9879 Open ISAPI Not handleing connections to MySQL correctly 11104 Open module slowly kills server 11201 Duplicate Simultaneous DB Links 11221 Open mysql_pconnect causes Access violations 11356 Open functions to use mysql-berkely-DBs-functions (commit,rollback) 11652 Open mysql_data_seek() and mysql_unbuffered_query() warning text 11765 Open Warning: MySQL: Unable to save result set in 11858 Open Insert queries add TWO records to database 11859 Open Insert queries add TWO records to database 11863 Open Cannot connect to mysql server 11920 Open e.g. mysql_unbuffered_query doesn't function but throws no error to indicate 11993 mysql_close closes incorrect db handler 12009 Open MySQL: Unable to save result set in 12010 Unable to save result set in 12029 Open "--with-apxs" can cause the error "MySQL: Unable to save result set in" 12031 Open Problems running IMAP and MYSLQ 12044 Open Duplicate mysql entries, in spite of only one query from php 12069 Open Another "MySQL: Unable to save result set in" problem... not solved... 12146 Open PHP warns if mysql have a special problem 12148 Open mysql ERROR: Update Query Failed problem with 4.0.6 12160 Open mysql_pconnect causes 99% CPU usage and system stop 12229 Open implicit_flush (off) causes mysql to see into the future 12392 Open mysql_pconnect() and timed-out connections ===============================================[Network related]============== 7058 Analyzed checkdnsrr bug 8754 Feedback gethostbyname() fails 10924 Suspended long2ip gives wrong result/binary arithmatic does not work 11028 Assigned ip2long use now unsigned integer and long2ip doesnt work 12076 Feedback Using fopen() to open files located on a remote machine on a NT LAN ===============================================[OCI8 related]================= 6089 Open ociplogon sometimes gives bus error 6585 Analyzed OCILogOff 7157 Open Cannot Suppot both Oracle and Informix 7306 Open segfault when binding undefined php variable with a BLOB hostvar 7575 Open php stops working correctly ! 7847 Open OCI8 support with Oracle 8.1.5 doesn't work 8482 Open undefined symbol: slpmprodstab 8976 Open Oci8 connection return error 9367 Open OCI Connection is disable 9496 Open Mixing non persistant and persistant connection makes all connexions persistant 10206 Open PHP in CGI mode fails to perform OCILogon 10275 Open can´t connect to oracle with NLS_LANG="BRAZILIAN PORTUGUESE_BRAZIL.WE8ISO8859P1 10455 Open The method fetchRow can't return NULL when no more data. 10654 Open Slight change to dead session detection? 10886 Open Warning: _oci_open_server: ORA-12154: TNS:no se ha podido resolver el nombre de 10926 Open Access Violation, reboot and then OCI no longer works 10997 Open Bad SQL query caused SegFault 11081 Open php crashes when using oci functions (8.1.7.0.1) 11169 Open OCILogon failed 11172 Open Can't connetc to Oracle DB 11341 Open OCI8 returns null password on logon at ora7 11539 Analyzed Oracle_Apache / PHP Installing 11799 Open OCIFetchInto/OCI_NUM starts the array at 0 not at 1 as stated in the doc 11999 Open Execute a storedprocedure using php 12077 php.exe application error - cannot 'read' memory address 12260 Open Compile failure --with-oci8 and Oracle 8.0.4 12269 Open session/oracle 12328 Open OCIStmtExecute: ORA-01460 12336 Open Unable to load dynamic library liboci8.so 12352 Open Unable to load dynamic library php_oci8.dll 12401 Open "break;" doesn't seem to work propery 12416 Open OleMainThreadWndName when using OCIFetchInto statement ===============================================[ODBC related]================= 2976 Duplicate odbc_execute miss-use SQLBindParameter 6275 Analyzed ODBC_Prepare/ODBC_Execute fails with parameters 6294 Open Strange behaviour when using DB2 6901 Analyzed odbc_columns 8227 Open odbc_field_name don't get tab1.field tab2.field back 8941 Analyzed Openlink/ODBC cannot parse complex queries 9284 Duplicate odbc_execute , SQL state 07001 in SQLExecute 9662 Open odbc_connect() acts like odbc_pconnect() 9738 Analyzed odbc_prepare does implicit SQLSetStmtOption (6,2) (sets to dynamic cursor) 10114 Open Error reading LONG fields (ntext) in MSSQL (SQL Server) (bug #5237) 10181 Analyzed odbc_result causes Unexpected network read error 10302 Open odbc_tables() 10469 Open ODBC_result() fails on DB2 LONG VARCHAR columns 10843 Open Function creates new array but does not reset pointer 11235 Duplicate DB2 ODBC driver memory leak 11451 Open ODBC under Apache: DLL Initialization Failed 11595 Assigned Error in the migration PHP3 to PHP4 with OpenLink-ODBC drive 11763 Open odbc_exec() throws ISE 500 error 11895 Open total crash of PHP 11911 Open Speed Problem 11935 Feedback php 4.0.6 doesn't work with solid option 11974 Open Pb with odbc_columns(); the 12th result(description)has a incorrect format 12166 Feedback SQL_CUR_DEFAULT constant not defined in php_odbc.dll 12228 Open type convretion problem 12263 Open odbc_tables(), odbc_results() 12339 Feedback Seg Fault in PHP under 2k /w ODBC and Globals (apparently)... 12371 Open SQLColumns Error when using odbc_columns on Oracle DB 12389 Open bad performance of odbc_free_memory with ibm db2 12423 Open float point assignment error ===============================================[OpenSSL related]============== 11885 Open Link problems with OpenSSL 0.9.6a ===============================================[Oracle related]=============== 9463 Open cmd line PHP crash with oracle+oci loaded 9630 Open Ora_Logoff doesn't return true or false. 9796 Open RAW datatype not handled in Ora_GetColumn 9917 Open left open Oracle cursors break mail() function 10361 Open make don't work for Oracle 8i on 64bit Solaris kernel 10416 Open Fetch_cursor return second record not first. 11486 Open Oracle connection resource disappears in nested connections 11550 Open Cannot return a NULL as out parameter of a stored procedure 11872 Open defunct Problems with oracle ===============================================[Other web server]============= 5653 Feedback PIKE specific: with setcookie(), only the last cookie is written 7282 Open "No input file specified." when run as a CGI 7615 Open Session management in thttpd / proxy problem 8898 Open #!/path/php at top of CGI script appears in output (Netscape Enterprise Server) 9131 Open PHP_AUTH* empty with Caudium 9342 Open 508 Bad Gateway Error 10159 Open bug with Caudium 1.0.2RC2 10390 Duplicate PHP CGI with AOLServer displays shebang 10804 Open No HTTP_POST_VARS 10931 Open IBM HTTP Server 1.3.12.2 can't load the php4apache.dll 11503 Duplicate display #!/usr/local/bin/php on first line with boa webserver 11699 Open Failure with Roxen/2.1.247 / Pike v7.2 release 30 12100 Open php with cern httpd as cgi can't execute in ie 12101 Open php with cern httpd as cgi can't execute in ie 12309 Open Bad downloads - PHP 4.0.x ISAPI ===============================================[Output Control]=============== 8536 Assigned ob_start() is not working with virtual() function 9805 Open ob_start("my_gzhandler1"); - not worked 10197 Open magic_quotes_runtime and other magic quotes sometimes are switching on or off. 10477 Open ob_start('function') is called before trans-sid is applied, not after 10495 Open Crash with ob_start(); 10499 Open User abort causes page to be dumped into error_log 10691 Open PHP crashes when using ob_-functions 10857 Open Syntax highlighting does not work with output buffering/compression 10903 Open Output buffering crashs PHP when mail function is invoked 10905 Open ImageGif (ImagePNG) output uncompressed 11093 Open Apache crashes when output buffering is used and fatal errors occure 12019 Open Syntax highlighting does not work with output buffering/compression 12022 Open limitations of php://stdout 12180 Open ob_start() + session_start() + die() == SIGSEGV 12227 Open Output puffering causes Apache to SIGSEGV 12315 Open Buffering crashes PHP when there is an error with mail function 12318 Open ob_gzhandler screws-up included .js files 12323 Open // comment tag does not work ===============================================[PCRE related]================= 10179 Open repetition quantifiers 10666 Open preg_replace 'e' modifier 10668 Analyzed preg_replace backquote failure 10669 Open Problem with preg_split 11236 Open addslashes() before preg_replace() gives parse error in regexp 11594 Open preg_replace is not working with backslash $ 12140 Open pcre_replace change behavior with \ ===============================================[PDF related]================== 10436 Open pdf_setcolor optional parameters not optional 10438 Open problem with pdf_get_pdi_paramter() 11900 Duplicate PHP_PDF.DLL 12014 Duplicate pdf_open_memory_image doesn't work so I try to use PDF_open_image but... 12021 Open Problem with the data parameter in pdf_open_image() ===============================================[Performance problem]========== 7747 Open after opening a socket and while reading from it php start growing CPU/MEM usag 7848 Open IMAP is very slow in CGI version 8782 Duplicate scripts run from CGI output "#!/usr/local/bin/php" line 8931 Open Memory leaks attributable to OO PHP 9407 Suspended Memory Problem while using self referencing objects... 9427 Critical PHP hangs when packets aren't returned when using session_start() 9431 Open httpd processes using excessive cpu 10299 Analyzed CPU and Memory Spike ===============================================[PHP options/info functions]=== 7842 Open doc_root setting behavior is wrong 8314 Open Setting the error_log = syslog does not work on Win2k 8584 Open ini_set creating untrue local values 8670 Open Incorect interpretation session.gc_maxlifetime parameter 8848 Open "open_basedir = /dir/incl" validates "/dir/include" and so on 9904 Open error_reporting setting in apache conf not respected in pages 10113 Open allow_persistent directive doesn't work 10354 Open disable_functions doe not work when set from httpd.conf 10463 Open ini_restore() doesn't restore to php.ini settings 10514 Open Uploaded file not stored in "upload_tmp_dir" 11006 Open include_path in php.ini broken 11612 Open php_include completely non-functional 11891 Open error_reporting option broken/changed 12194 Open Php_open_temporary_file.c doesn't handle trailing slash on path. 12342 Feedback error in configuration with pthread ===============================================[POSIX related]================ 12025 Open posix_getgrnam() failed ===============================================[PostgreSQL related]=========== 8769 Open Persistent connections aren't closed when using dynamically loaded module 9185 Open postgresql backend process become stale after php page loads 9273 Open feature request: pg_cancel() 9888 Open Error from Apache when work with PostgreSQL 10276 Open persistent connections overload 11229 Duplicate 1 is not valid postgresql link resource 11328 Open can't create large object 12108 Open Unable to connect to PostgresSQL server ===============================================[Program Execution]============ 3076 Analyzed system and popen are ok in safe_mode, not backquotes 8725 Open Fun with putenv 9912 Open exec calls run programs in the document root: different than PHP3 11023 Open exec does not wait for completion of cmd 11430 Open PHP-CGI executing PHP-CGI thru Apache 11546 Analyzed Register_Shutdown_Function doesn't happen after shutdown 11649 Feedback Unable to Fork errors 11767 Open Bad escape sequence 12300 Open exec() family problems ===============================================[PWS related]================== 10877 Open HTTP 500 Error and the page cannot be displayed 10943 Open After a migration from php4.0.4 to php4.0.5 11913 Open include() before sending headers causes hang 12358 Feedback CGI Error-CGI application misbehaved 12396 Feedback no errors, no php 12446 Open php4isapi.dll path ===============================================[Recode related]=============== 9223 Suspended recode_string leaks memory 10813 Open recode utf-8..l2 doesn't work ===============================================[Regexps related]============== 12368 Open Regexp limit the string size ===============================================[Reproducible crash]=========== 7219 Duplicate Mysql-related stack fault with PHP 4.0.3 8471 Suspended Crash on infinite recursive calls. 10324 Assigned reproducable seg fault during generic script exec with pgsql and mcrypt 10904 Open php.exe accesses unreadable memory and crashes 11061 Duplicate Crash while recursivly call of a class method 11679 Open crash on webserver start 11806 Assigned Using $string = md5($string); crashed HTTP child processes 11826 Feedback Custom sessions handler using Metabase calls crashes Apache 11838 Feedback Apache crashed after PHP inicialization 11921 Open Apache 1.3.20, mod_ssl 2.8.4, PHP 4.0.4 crashes in CGI mode 11933 Open array_map causes segfault 11996 seg fault viewing php w/ Apache 1.3.20 11998 Open Crash on multipart file form upload 12032 Feedback PHP dumps core when using a 3x derived class from a series of included files 12040 PHP dumps core when using a 3x derived class from a series of included files 12049 Crash in Zend Engine 12109 Open Crash bug with shell_exec() 12118 Feedback Apache crashes without error after some time of running 12144 Open Error in execution operator (dir .\*.*) 12154 Open GP Fault in Kernel32 if buffer too small in fgetcsv() 12198 Open Problem with recursive function - only works if I echo something in it 12217 Feedback Apache + oracle + php 4.0.6 + debian 12239 Open crashes on Mail() 12262 Feedback php.exe - Entry Point Not Found 12270 Analyzed php4ts.dll crashes due to null-pointer assignment on shutdown 12331 Feedback segfault with incorrect mysql_connect() parameters 12404 Open ISAPI mode exec() access violation 12408 Open Premature end of script headers - again 12448 Open Disturbing memory corruption/crash ===============================================[Sablotron XSL]================ 7631 Open Log file created but not written to. 8412 Open transformations hang 9398 Open Apache SIGTERM when loading php with pspell AND sablotron 10569 Open xslt_error handling 11440 Open PHP Seg faults with xslt_output_begintransform("xsl_file"); 11777 Open php apache dso coredumps using die() inside function for xslt_set_error_handler 11849 Open random "duplicit rule name" error 12099 Open SIGSEGV bug in module sablotron ===============================================[Satellite CORBA related]====== 12276 Assigned error orbit_object ===============================================[Scripting Engine problem]===== 6231 Analyzed Reference parsing problem 6417 Analyzed Incorrect behaviour with references and arrays 6685 Analyzed %20 mis-converted in GET mechanism 7515 Assigned very weird, magic, invisible referencing 7973 Open Safe Mode absolute path behaviour changed 7981 Duplicate Safe Mode absolute path behaviour changed 8500 Duplicate double constants with different locale 9763 Open Segmentation Fault upon running big cl script 10068 Open referenced objects 10308 Open include_path not functioning 10372 Duplicate php addslashes() the entire page 10437 Analyzed casting is not consistent 10443 Open PHP Crashes when it opens complicated pages 10485 Open "no input file specified" when running as a CGI 10840 Open asp_tags = On is ignored, if apache is started with the php4_module 10876 Feedback Main thread error if die placed in file which uncluded from switch-case operato 11042 Open magic_quotes_runtime() value not reality 11071 Open probs displaying backslash with HERE statements 11103 Open different cookie behavior with module vs. cgi 11163 Open Serialize an object which has another object 11168 Open Problem with serializing more dimensional array with references ... 11199 Analyzed fopen wrapper is broken. fopen('http://www.php.net/','r') does not work. 11337 Open SEGV when using mysql connections in OO-setting 11536 Open register_tick_function weirdness 11565 Duplicate classes/objects 11670 Open Apache multipart POST weirdness 11676 A few apache children consume all memory and CPU. 11692 Open CGI problem with http://myweb/script.php/variable 11723 Open A few apache children remain in memory after apachectl stop 11739 Open Memory limit is used for all scripts instead of one script? 11883 Feedback unmotivated memory exhausting 11918 Open Serialization? 11969 Feedback PHP repeats ODBC queries when using include()... 11970 Open SEPARATE_ZVAL_TO_MAKE_IS_REF doesn't like 0x0 12046 Open Strange handling of negative hexadecimal numbers 12139 Feedback strtoupper/strtolower do not convert umlauts 12157 Open copying a single quote from MS word causes form variable to disappear. 12171 Open Require() function malfunction across directories 12172 Open Failure to bind a variable to an object's method that returns a reference 12203 Open Inconsistent __FILE__ contents when using require/require_once 12251 Open Error with zend_hash.c after writing a file 12257 Open list() construct doesn't work as expected. 12278 Analyzed variable variable inside a string 12280 Suspended $file=fopen("http://".$HTTP_SERVER_VARS["SERVER_NAME"].$PHP_SELF, "r"); 12289 Open Not fully reproducable include-errors 12313 Open parent resolving and deep require's 12314 Feedback include_path does not work 12361 Open zend_alloc.c fails to track AG(allocated_memory) properly 12407 Analyzed if else statement correct in 4.0.5 but not 4.0.6 ===============================================[Semaphore related]============ 8985 Open shm_put_var wont put the given var into memory 9259 Open crash when accessing shared memory + more info on bug #8985 10530 Open shmop.c: shmop_open() with mode "a" is miscoded 10656 Open shmop_open permissions incorrect for writing ===============================================[Session related]============== 3793 Analyzed session.gc_maxlifetime does not work 6121 Assigned Transparent Session ID doesn't pick up redirects 8118 Assigned error in much warnings in session.c 8545 Analyzed Session variables not carried forward in Netscape Client 8989 Open Bug#5493 resurfaced 9191 Duplicate Problems when rejecting cookies 9264 Analyzed Using session_encode with user-level session storage functions causes a crash 9639 Feedback Nasty bug in mod_mm.c causes CGI POST to stop working 10833 Feedback Hyperlink tag <a> when split on multiple lines, session ids are not propagated 10895 Feedback Segmentation Fault 10955 Feedback session configured with session_set_save_handler and a database 11527 Open session_unregister() seems not work properly 11573 Feedback Malformed HTTP response Header 11643 Analyzed SID redefined 11852 Open Session ID not transferred correctly within framesets 11861 Open Can't set any session variable 11886 Suspended bug #8908 is still alive in 4.0.6 11957 Open session url rewrite isn't working 12056 Duplicate Transparent Session ID doesn't pick up redirects 12170 Open sessionid is attached with a '?' instead of the arg_seperator 12177 Open session_set_cookie_params broken 12188 Feedback Object with Sessiona 12218 Open relative URL incorrect when a "session id" is appended to URL 12230 Open Error with Object saved in Session 12236 Open session_start() inside a function destroys reference to $HTTP_SESSION_VARS 12291 Open Apparent memory leak, possibly in session code 12298 Open transparent sid doesn't work with transparent gzip compression 12299 Feedback Opening a new session truncates the html output ===============================================[SNMP related]================= 9059 Feedback SNMP compile issue ===============================================[Sockets related]============== 5480 Open set_socket_blocking($fp, False) don't work ! 6914 Open persistent socket connection failure 7420 Open Still problem with fsockopen - fgets - fputs 7723 Open pfsockopen doesn't read more than one time 7786 Open cannot use fsockopen to open a connection, errNO is 0, errMsg is NULL 7971 Analyzed Unable to open web sites using fope()n command 8170 Open fsockopen and fopen with ip address not active 8775 Open pfsockopen - socket_get_status has EOF set.. feof() returns false 9100 Open problem with UDP 9229 Open Sockets extension does not compile -- possible problem 10001 Open Socket reading functions always timeout 10092 Open Socket fgets memory and CPU usage problem 10204 Open fgets causes memory leaks 10304 Open Garbled Data/timeout with UDP-Socket 10426 Open pfsockopen resource is not client site persistent. 10765 Open timeout doesn't work 10830 Open Cannot bind() a socket to a specific port in FreeBSD 11162 Open pfsockopen closes connection after script finishes 12360 Analyzed fsockopen timeout doesn't work ===============================================[Strings related]============== 7472 Analyzed problem with strip_tags() function 8097 Open printf() and float data vs.setlocale() 11961 Open \r\n or \n 12120 Several following < characters ignored by striptags() 12281 Feedback base64_encode 12437 Open string incrementing is different from before ===============================================[Sybase (dblib) related]======= 8349 Open Accessing a text field 9171 Open Query Timeout 9244 Open sybase-ct does not report MSSQL-server errors 9402 Open never ending cycle 10347 Open Core Dump when selecting TIMESTAMP with FreeTDS and SQL Server 10917 Open Feature request: deal with the BLOB data 11171 Open Faulty MSSQL-queries locks PHP 11188 Open translate national characters in freeeTDS-driver ===============================================[Sybase-ct (ctlib) related]==== 6571 Open memory leak when selecting text type fields 7609 Analyzed New connections made 7792 Assigned -lsybctl failure at FreeTDS 8151 Open Restart apache server, FreeTDS stop running ? Help 911 !!! 8251 Open Sybase Messages Below Minimum Severity 8269 Duplicate Compile cant find Sybtcl .... Help! 8313 Open the sysbase type float(15) is handled incorrectly 8947 Open php don't compile using --with-sybase and FreeTDS (php 4.0.0 does) 8954 Assigned compiling with sybase-ct fails 9491 Open sybase_connect memory error 9693 Open Killed persistent connections not recognized 9911 Open Segmentation fault of httpd (w/mod_php4) 10597 Open RE #5684: PHP Intermittently reports "Unable to allocate connection record" 11102 Open Win NT +Sybase 12 +Php4.05 + IIS +sybase_connect CAN NOT WORK 11475 Open stored procedure processing 11490 Open mssql_connect() broken, mssql_pconnect() fixes it 11559 Duplicate charset optional argument doesn't work with sybase_[p]connect 11986 Open the problem of php and sybase connection has not been fixed ===============================================[Unknown/Other Function]======= 11831 Open Connection Handling Functions Broken 11902 Feedback Defined constants carry over to next script call 11904 Assigned ext/standard/string.c patch for nl2br() 11945 ignore 11951 Feedback HTML encoding problem 12083 addslashes 12137 Open PEAR/DB : DB_common::executeEmulateQuery() bug 12219 Analyzed Command Line Arguments not being passed correctly 12353 Feedback PHP4.0.05, should be apache 1.3 API, not EAPI, please recompile DEAPI 12386 Feedback Mac Carriage Returns cause PHP to choke ===============================================[Variables related]============ 10519 Open $HTTP_COOKIE_VARS spoofing 12243 Open Large numbers not behaving as doubles 12245 Open gettype(true && true) returns "integer"! 12247 Open ternary ?: loses references ===============================================[Verisign Payflow Pro related]= 10652 Open payflow pro support core dumps ftp 12295 Open Unable to compile Verisign Payflowpro ===============================================[Website problem]============== 12234 Open got an error browsing your site (www.php.net) 12307 Analyzed Using "quotes" in a search 12351 Open admin-notes.php has issues with edits. 12356 Open Linkproblem at Mirror www.php3.de 12362 Open Bug report page needs better Bogus bug preventing 12363 Open Other people should be able to comment on bugs 12373 Analyzed netscape 4.77 stylesheet problem 12393 Open OS field not passed on on error in bug report 12419 Open Web Site Problem --> Feature Request : Treeviews for comments 12424 Open clock on rsync.php.net ===============================================[XML related]================== 6175 Open XML functions no longer work in objects 6500 Open XML - startElementHandler 6665 Open object variables get 'unset' when assigned within xml handlers 6671 Duplicate using the XML parser in a class does not seem to work any longer 7133 Open xml_set_object() should not copy the object 8522 Open Error in XML parser with win98/PWS 9598 Open Variables in class referenced by xml_set_object are not in scope with xml_parse 10254 Open xml_set_object() and segmentation fault 10303 Open Crash while parsing large XML file and writing to DB 10873 Open internal xmlparser eats only formatted xmlstrings... 11316 Open segfault, possibly in xml functions 11321 Open memory corruption when parsing large XML files 12261 Open xml_parser_get_option doesn't get all option that xml_parser_set_option can set 12286 Open xml_parse isn't returning FALSE with malformed <?xml ...?> element ===============================================[YP/NIS related]=============== 10706 Open yp_next does not report the next entry in the map 11875 Open bad retiurn in yp_first 11919 Open bad return of yp_next 12345 Open Error in yp_match return value ===============================================[Zlib Related]================= 12091 zlib uncompress buffer error/ inflate failed Assigned bugs: (reminders sent) bmcadams@php.net 10447: ccvs_*() functions segfault when given invalid session ID andre 9068: Bugs in OO which are leaking memory... andre 9117: output_handler = ob_gzhandler andre 8536: ob_start() is not working with virtual() function andre 7515: very weird, magic, invisible referencing jmoore 9469: HAVE_REALPATH not being checked jmoore 8252: $PATH_INFO instead of $PHP_SELF in CGI mode jmoore 12191: Certificate Environment Variables missing with ISAPI derick 9640: strtotime() cannot properly handle some ISO 8601-compliant strings derick 10550: mktime() returns -1 for certain valid dates derick 10694: mktime leap year bug derick 11013: The Windows CHM format help file is missing a section. derick 10187: Warning: mcrypt module initialization failed derick 11642: mcrypt_generic() leaks memory derick 11028: ip2long use now unsigned integer and long2ip doesnt work derick 10324: reproducable seg fault during generic script exec with pgsql and mcrypt derick 11806: Using $string = md5($string); crashed HTTP child processes derick 11904: ext/standard/string.c patch for nl2br() hholzgra 7888: decrement syntax should be -- instead of - hholzgra 9356: settype thinks 0.2 and (1.2 - 1) have different values hholzgra 7629: Mail() fails when the email message has a "\n" hholzgra 7068: fails when 'to:' argument has the form "Name <name@somewhere.xxx>" hholzgra 8909: PHP generates the Date: header line with a bad timezone hholzgra 10136: Function mail() does not work properly hholzgra 10182: problem with the "To" field hholzgra 11165: limit in lenght of mail hholzgra 11247: mail() on Win32 messes with Reply-To: or Errors-To: fields, hholzgra 11348: cannot send email attachments hholzgra 11349: Function not working as documented hholzgra 11616: Cc: & Bcc: not being picked up from header dbeu 11619: Socket function examples scripts aren't working with latest CVS jeroen 11937: Bug in array handling jeroen 12011: Safe_mode poor documentation zeev 2220: dynamic module memory leaks cause SIGSEGV under DEBUG mode zeev 10263: Use of istdiostream w/o HAVE_CLASS_ISTDIOSTREAM protection zeev 6827: End of generated html is truncated on large page andrei 8100: extract(), extra feature sniper 7670: PHP crashes when accessing IMAP mailbox danny 6798: IFX queries fail, SQLCODE -480 (dup. descriptors) jah 6976: ibase_query can't execute SQL statements that can't be prepared jah 7014: ibase_query (rest of php_interbase.dll?) david 6537: mail() does not seem to handle SMTP multi-line responses kir 9498: quoted_printable_decode - Incorrect function result 11797: CC and BCC don't work in mail() function ahill 11595: Error in the migration PHP3 to PHP4 with OpenLink-ODBC drive eriksson 12276: error orbit_object sas 6121: Transparent Session ID doesn't pick up redirects sas 8118: error in much warnings in session.c joey 7792: -lsybctl failure at FreeTDS joey 8954: compiling with sybase-ct fails

« previous php.dev (#61326) next »