Bug #9604 Updated: Unable to compile CVS Source with Informix support (executor_globals undeclared
| From: | sniper@php.net | Date: | Sat, 04 Aug 2001 03:11:51 +0000 |
| Subject: | Bug #9604 Updated: Unable to compile CVS Source with Informix support (executor_globals undeclared | ||
| References: | 1 | Groups: | php.dev |
| Request: | Send a blank email to php-dev+get-62036@lists.php.net to get a copy of this message | ||
ID: 9604
Updated by: sniper
Reported By: jalonso@starcontents.com
Old Status: Open
Status: Closed
Bug Type: Informix related
Operating System: Solaris 8 (Sparc)
PHP Version: 4.0.4pl1
New Comment:
Fixed in CVS.
Previous Comments:
------------------------------------------------------------------------
[2001-03-07 13:22:10] jalonso@starcontents.com
/bin/sh /usr/local/distrib/php4/libtool --silent --mode=compile gcc -I. \
-I/usr/local/distrib/php4/ext/informix -I/usr/local/distrib/php4/main -I/usr/local/distrib/php4 \
-I/usr/netscape/server4//include -I/usr/local/distrib/php4/Zend -I/opt/informix/incl/esql \
-I/usr/netscape/ldapsdk/include -I/usr/local/distrib/php4/ext/xml/expat/xmltok \
-I/usr/local/distrib/php4/ext/xml/expat/xmlparse -I/usr/local/distrib/php4/TSRM \
-D_POSIX_PTHREAD_SEMANTICS -D_POSIX_PTHREAD_SEMANTICS -D_REENTRANT -DSUPPORT_UTF8 \
-DXML_BYTE_ORDER=21 -I../TSRM -g -O2 -pthreads -I/opt/informix/incl/esql -c ifx.c
/usr/local/distrib/php4/ext/informix/ifx.ec: In function `php_minit_ifx':
/usr/local/distrib/php4/ext/informix/ifx.ec:392: warning: passing arg 2 of `ts_allocate_id'
from incompatible pointer type
/usr/local/distrib/php4/ext/informix/ifx.ec: In function `php3_intifxus_free_slob':
/usr/local/distrib/php4/ext/informix/ifx.ec:4358: `executor_globals' undeclared (first use in
this function)
/usr/local/distrib/php4/ext/informix/ifx.ec:4358: (Each undeclared identifier is reported only once
/usr/local/distrib/php4/ext/informix/ifx.ec:4358: for each function it appears in.)
make[3]: *** [ifx.lo] Error 1
make[3]: Leaving directory `/usr/local/distrib/php4/ext/informix'
make[2]: *** [all-recursive] Error 1
make[2]: Leaving directory `/usr/local/distrib/php4/ext/informix'
make[1]: *** [all-recursive] Error 1
make[1]: Leaving directory `/usr/local/distrib/php4/ext'
------------------------------------------------------------------------
Edit this bug report at http://bugs.php.net/?id=9604&edit=1