Bug #12817: problems building apache with libmodphp4.a
| From: | mgregory at cimedia dot com | Date: | Fri, 17 Aug 2001 18:31:26 +0000 |
| Subject: | Bug #12817: problems building apache with libmodphp4.a | ||
| Groups: | php.dev | ||
| Request: | Send a blank email to php-dev+get-63551@lists.php.net to get a copy of this message | ||
From: mgregory@cimedia.com
Operating system: RH 7.0
PHP version: 4.0.6
PHP Bug Type: Unknown/Other Function
Bug description: problems building apache with libmodphp4.a
This seems to be a php problem, not an apache one so I'm posting it
here...
When running make on apache with the
--activate-module=src/modules/php4/libmodphp4.a configure option mod_php.c
throws these erros:
mod_php4.c:28:18: zend.h: No such file or directory
mod_php4.c:29:17: php.h: No such file or directory
mod_php4.c:30:27: php_variables.h: No such file or directory
mod_php4.c:47:21: php_ini.h: No such file or directory
mod_php4.c:48:25: php_globals.h: No such file or directory
mod_php4.c:49:18: SAPI.h: No such file or directory
mod_php4.c:50:22: php_main.h: No such file or directory
mod_php4.c:52:26: zend_compile.h: No such file or directory
mod_php4.c:53:26: zend_execute.h: No such file or directory
mod_php4.c:54:28: zend_highlight.h: No such file or directory
mod_php4.c:55:25: zend_indent.h: No such file or directory
mod_php4.c:57:39: ext/standard/php_standard.h: No such file or directory
make[4]: *** [mod_php4.o] Error 1
make[3]: *** [all] Error 1
make[2]: *** [subdirs] Error 1
make[2]: Leaving directory `/usr/local/src/apache_1.3.20/src'
make[1]: *** [build-std] Error 2
make[1]: Leaving directory `/usr/local/src/apache_1.3.20'
make: *** [build] Error 2
The configure options for php:
--with-mysql --with-oracle=/home/myhome/OraHome
The configure options for apache:
--activate-module=src/modules/php4/libmodphp4.a
Everything is default out of the source tarballs for apache and php. There
are no special modifications to either. Make is being run as root. All
files are located in the same source directory. I have tried 3 complete
fresh builds to be sure.
--
Edit bug report at: http://bugs.php.net/?id=12817&edit=1